program: Gaussian 09
title: 000029279
version: EM64L-G09RevD.01
frameworkgroup: C1[X(C19H25N3O3)]
method: RPBEPBE
basis: SDD
operation: Freq
keyword: #p
keyword: freq=noraman
keyword: PBEPBE/SDD
title: #p freq=noraman PBEPBE/SDD
converged: YES YES NO NO
title: Mulliken charges:
elementType: O O O N N N C C C C C C C C C C C C C C C C C C C H H H H H H H H H H H H H H H H H H H H H H H H H
charge: -0.286646 -0.210125 -0.202828 -0.021476 -0.078723 0.022364 -0.390306 -0.565816 -0.387019 0.232055 -0.395400 -0.501534 -0.034238 0.140306 0.269920 -0.033110 -0.298103 -0.409851 -0.338423 -0.493432 -0.328764 0.404434 -0.412762 -0.626532 -0.614216 0.197859 0.211460 0.248116 0.213984 0.208988 0.189951 0.212780 0.213179 0.202417 0.244693 0.215201 0.211067 0.231130 0.224076 0.265450 0.317280 0.174900 0.205602 0.285831 0.186599 0.223233 0.237834 0.225274 0.188705 0.224614
chargesum: 0.00000
title: Mulliken charges with hydrogens summed into heavy atoms:
elementType: O O O N N N C C C C C C C C C C C C C C C C C C C
charge: -0.286646 -0.210125 -0.202828 -0.021476 -0.078723 0.022364 0.019014 -0.103715 0.011920 0.232055 0.030559 -0.054424 -0.034238 0.140306 0.269920 -0.033110 0.128165 0.045355 -0.072973 -0.176152 0.051738 0.404434 -0.126931 0.021134 0.024377
polarizability: 3.01812068e+02 3.74620371e+01 3.30188086e+02 -1.68107865e+01 3.10654044e-01 1.48219963e+02
1716.lowfreq: -5.6880 -1.5828 -0.0006 0.0005 0.0008 2.7423 6.1627 20.6997 32.8969
frequency: 4.9912 20.6268 32.8809 45.9439 49.9927 62.2883 84.3601 89.4440 95.6313 114.9895 125.9913 133.4351 156.5858 189.3695 207.3082 229.2602 241.2042 243.1523 253.3917 271.7864 282.7142 319.6672 322.0167 333.0866 339.1327 354.3624 372.2554 412.0376 426.7987 450.9789 465.3298 473.2329 488.7393 504.3765 530.3046 561.6139 575.3882 596.0627 654.9839 666.1690 679.9911 709.1810 727.6421 757.4446 766.7990 770.9535 797.9849 807.8175 829.6123 837.7006 856.6688 867.3859 874.0292 890.8820 901.2563 936.9589 946.5424 957.6721 959.6248 995.5341 1023.9087 1028.5426 1033.5567 1044.1050 1064.8457 1067.1585 1070.8206 1081.9841 1092.7234 1097.9151 1107.2664 1119.4292 1131.9804 1141.4811 1160.4436 1171.6245 1202.1611 1205.9334 1210.2774 1217.1286 1229.4205 1250.1782 1251.7416 1260.7341 1268.6594 1272.8487 1285.8443 1298.2722 1311.8308 1318.1508 1321.7099 1338.6244 1343.1021 1356.0146 1366.7172 1371.5226 1376.8878 1383.4347 1392.5463 1419.2461 1425.7467 1433.9556 1443.2961 1453.3658 1460.2258 1461.3998 1462.2159 1463.7285 1469.9317 1474.9564 1476.1033 1478.3431 1478.6619 1481.9862 1487.2705 1496.1601 1556.4719 1575.5308 1614.2504 2814.6802 2846.3582 2862.4434 2955.4526 2960.9245 2969.4834 2971.1476 2975.1311 2980.1984 2996.7790 3009.5751 3010.5966 3020.3345 3020.9552 3030.2394 3033.7192 3041.6113 3058.6579 3072.5471 3076.5876 3079.7397 3090.2799 3158.4339 3189.0130 3191.2537
redmass: 4.7751 2.4786 5.0172 6.3077 5.2192 3.5733 3.4626 3.9652 2.0353 3.6699 4.1981 2.6509 4.5818 2.6984 3.5764 1.2539 1.3186 2.2636 6.6758 4.8726 3.4016 3.2134 3.6829 2.2743 2.6469 3.7011 3.0284 3.8263 2.6903 2.7367 4.0814 3.0084 3.9351 2.6293 4.3382 4.8430 4.9424 4.8660 5.2895 6.2550 6.2599 6.7141 3.4867 4.9080 2.9351 1.2973 2.8454 3.8869 1.6445 2.4040 1.8035 2.5448 1.2362 3.0611 4.1308 4.5226 1.5203 2.0058 2.3757 1.3173 2.4733 3.5126 1.6323 2.2141 2.1088 2.2783 2.1771 2.5487 1.3765 1.5613 1.9751 2.0511 1.3160 1.4997 1.7781 1.4340 1.4917 1.3635 5.5053 1.8009 2.9830 1.6360 1.3767 2.2367 1.2863 1.1803 1.3492 1.3290 2.6380 1.4434 1.4540 1.4701 1.8330 1.4508 2.4544 4.0012 1.5990 2.5596 2.1011 1.1447 4.8399 4.9092 1.1671 1.2107 1.0875 1.0503 1.0697 1.0919 1.1079 1.1356 1.1933 1.7236 1.0632 1.1951 1.1012 1.1547 9.5121 8.5871 7.4068 1.0704 1.0573 1.0571 1.0556 1.0615 1.0644 1.0666 1.0646 1.0617 1.0837 1.0753 1.0920 1.0958 1.0728 1.1024 1.0719 1.1027 1.0941 1.0943 1.1042 1.1013 1.1004 1.0893 1.0948 1.0935
irintensity: 0.5667 0.8793 0.4810 0.0297 0.1390 0.3919 0.8638 0.5706 1.2701 0.8165 1.2589 1.8553 0.2186 0.4614 1.9338 0.8337 0.7830 1.2342 2.1986 2.4766 4.4137 0.4318 3.1490 8.7425 0.1065 4.9365 1.2424 0.1138 2.0639 1.0660 4.6467 6.9876 1.9368 3.4456 7.5785 1.7039 0.1965 4.3881 7.1415 7.6794 5.4264 17.3693 4.0084 18.2662 7.6278 6.4507 3.5097 7.4735 13.0527 9.9505 26.1162 7.8734 0.6552 1.7047 26.4683 65.2753 23.8697 14.6336 18.3809 0.6574 20.1651 144.6880 9.0145 28.5076 30.5760 1.7245 5.8249 30.5664 5.7563 5.8888 14.7248 7.9019 9.9143 7.7501 9.2314 7.3693 63.6381 18.9246 343.4019 4.5147 43.4242 12.9516 22.3478 4.7125 2.4988 0.2153 0.6179 3.7220 111.4921 1.1983 0.8011 8.3399 44.9235 0.9115 24.0215 77.7926 35.0979 6.7633 16.1781 2.2957 46.7030 4.0018 3.1919 7.7736 4.5990 15.8077 10.2420 6.2008 11.8339 9.8869 22.7652 36.0710 10.2803 12.7579 39.2014 1.3557 8.1178 45.7439 17.6002 76.5180 68.2756 202.1028 29.2069 37.5856 26.6799 16.5526 25.2922 30.7716 17.5749 19.8556 28.2036 62.9354 54.3377 30.0371 44.0071 88.1824 20.3665 13.4939 25.2242 43.2075 45.5287 4.9484 0.9626 7.3835
temp: 298.150 k
press: 1.00000 atm
elementType: 8 8 8 7 7 7 6 6 6 6 6 6 6 6 6 6 6 6 6 6 6 6 6 6 6 1 1 1 1 1 1 1 1 1 1 1 1 1 1 1 1 1 1 1 1 1 1 1 1 1
symmnumber: 1
zpe: 1082345.8 jmol-1
zpe.correction: 0.412244 hartree
zpe.thermalcorrener: 0.436458 hartree
zpe.thermalcorrenthalpy: 0.437402 hartree
zpe.thermalcorrgfe: 0.354800 hartree
zpe.sumelectzpe: -1126.974572 hartree
zpe.sumelectthermal: -1126.950358 hartree
zpe.sumelectthermalent: -1126.949414 hartree
zpe.sumelectthermalfe: -1127.032016 hartree
dipole: 7.4800 3.8265 0.6371
dipole: 8.4261
quadrupole: -176.5685 -147.6406 -149.9966
quadrupole: -24.6538 9.0842 2.5172
quadrupole: -18.4999 10.4280 8.0720 -24.6538 9.0842 2.5172
hfenergy: -1127.386816 hartree
pointgroup: C01 [X(C19H25N3O3)]
dipole: -3.0444021 1.2902254 -0.238121 debye
polarizability: 307.284998|-39.0352042|324.6546736|-17.2633487|-0.5924833|148.2804453 unknown
InChI: InChI=1S/C19H25N3O3/c1-21(2)11-6-12-25-19-15-7-4-3-5-8-17(15)20-18-13-14(22(23)24)9-10-16(18)19/h9-10,13H,3-8,11-12H2,1-2H3
charge 0 multiplicity 1
50 atoms
O  -1.310396 -0.119339 1.010281
O  4.387567 -4.040721 -0.363878
O  5.622196 -2.161938 -0.743955
N  2.429694 1.650498 -0.011848
N  -5.751346 -1.948188 -0.195075
N  4.519271 -2.756554 -0.434891
C  -1.599394 3.639646 -0.320562
C  -1.127008 2.786815 0.895444
C  -0.735347 4.891789 -0.599039
C  0.050172 1.877804 0.602445
C  0.743856 4.615038 -0.956945
C  1.568047 3.918935 0.165611
C  1.353009 2.419249 0.259822
C  -0.082084 0.480971 0.652546
C  1.044484 -0.373733 0.39608
C  2.293304 0.270807 0.056341
C  -2.219457 -0.406261 -0.137961
C  -3.475858 -1.064913 0.432347
C  0.981468 -1.801455 0.476564
C  3.439688 -0.532672 -0.218643
C  -4.418286 -1.540842 -0.695009
C  3.32608 -1.922825 -0.144323
C  2.106797 -2.578063 0.208163
C  -5.706626 -3.127951 0.693915
C  -6.713311 -2.135406 -1.301778
H  -1.636999 3.000763 -1.226271
H  -2.638168 3.970243 -0.123458
H  -1.961892 2.163789 1.260565
H  -0.863408 3.477273 1.722758
H  -1.200328 5.468604 -1.423372
H  -0.766101 5.548197 0.296131
H  1.231522 5.583128 -1.183048
H  0.806516 4.010057 -1.88322
H  1.324123 4.400452 1.135468
H  2.64541 4.069243 -0.016271
H  -2.45755 0.545535 -0.655842
H  -1.695671 -1.074698 -0.853074
H  -4.018243 -0.347047 1.073846
H  -3.16252 -1.910663 1.071622
H  0.038579 -2.268753 0.775768
H  4.385174 -0.052078 -0.479766
H  -3.918702 -2.367851 -1.269383
H  -4.57632 -0.707107 -1.408424
H  2.088592 -3.668919 0.265187
H  -5.287975 -4.03911 0.193368
H  -6.729295 -3.365684 1.036027
H  -5.097342 -2.915525 1.588253
H  -7.714068 -2.355265 -0.88941
H  -6.43639 -2.969177 -1.996688
H  -6.786159 -1.205895 -1.894518
