program: Gaussian 09
title: 000029218
version: EM64L-G09RevD.01
frameworkgroup: C1[X(C16H22O4)]
method: RPBEPBE
basis: SDD
operation: Freq
keyword: #pfreq=noraman
keyword: PBEPBE/SDD
title: #p freq=noraman PBEPBE/SDD
converged: YES YES NO NO
title: Mulliken charges:
elementType: O O O O C C C C C C C C C C C C C C C C H H H H H H H H H H H H H H H H H H H H H H
charge: -0.292160 -0.292172 -0.250092 -0.250077 -0.081462 -0.081481 -0.246294 -0.246320 -0.688766 -0.696738 -0.688682 -0.696740 0.232535 0.232553 0.186402 0.186419 -0.346329 -0.346317 -0.332551 -0.332587 0.214852 0.214814 0.230918 0.222576 0.230882 0.222653 0.213835 0.203259 0.236091 0.222761 0.216424 0.209493 0.213777 0.203275 0.236084 0.222759 0.216409 0.209528 0.275300 0.275310 0.269924 0.269934
chargesum: 0.00000
title: Mulliken charges with hydrogens summed into heavy atoms:
elementType: O O O O C C C C C C C C C C C C C C C C
charge: -0.292160 -0.292172 -0.250092 -0.250077 0.133390 0.133333 0.207200 0.207215 -0.035580 -0.048059 -0.035546 -0.048045 0.232535 0.232553 0.186402 0.186419 -0.071030 -0.071007 -0.062627 -0.062653
polarizability: 2.90011384e+02 1.05338033e-02 1.89805735e+02 7.91930344e+00 -3.09644369e-03 1.16399166e+02
1716.lowfreq: -7.6523 -3.0074 -0.0001 0.0008 0.0009 8.0639 18.1816 28.7930 31.3404
frequency: 18.1734 28.7616 31.3164 33.2613 44.6041 58.5560 69.2910 75.2542 85.9605 147.4951 154.9973 177.9174 190.6253 196.9595 198.8146 205.7981 232.2583 237.9236 250.3304 270.3022 277.5503 330.9914 340.3210 388.6580 391.1092 407.4128 413.8434 415.4302 467.0202 487.7427 504.7634 537.3396 628.6522 664.5168 678.6225 697.9597 771.1621 777.3812 800.7301 842.1044 847.0785 871.7697 885.6079 886.4453 892.2803 911.8949 912.9734 923.5275 923.8979 960.9991 961.6587 965.5629 965.7680 1001.9930 1010.5861 1013.9427 1062.8218 1071.9507 1114.4720 1135.5240 1135.6489 1151.0070 1151.0596 1181.0628 1189.6100 1189.6175 1230.6785 1232.1402 1233.9292 1252.9284 1295.4498 1296.2675 1301.2266 1340.2556 1340.4004 1364.1044 1364.7169 1377.8911 1377.9176 1386.2405 1397.8580 1397.8969 1408.7007 1461.6852 1461.8090 1468.5597 1468.6310 1473.6664 1473.7710 1480.7708 1480.8212 1489.4214 1489.6968 1492.8742 1568.2853 1610.1190 1619.2220 1622.0286 2973.3725 2973.4005 2976.5756 2976.6218 2988.9962 2989.0729 2996.5954 2996.6806 3060.5741 3060.6411 3065.0738 3065.0945 3074.3562 3074.4254 3080.3122 3080.3720 3088.7295 3088.8308 3153.5276 3165.7025 3171.6770 3185.2832
redmass: 3.2328 3.2628 3.1903 3.9793 3.5144 5.8500 4.3436 3.8081 6.0916 2.7874 4.1443 2.0800 2.7913 1.2745 1.3656 2.3242 1.1296 1.3286 3.5221 5.4573 4.8273 3.5491 3.2615 2.5684 3.2689 2.8612 2.0314 1.9850 3.9828 5.0932 5.3130 5.4261 7.1293 6.1456 7.4583 3.5299 5.8970 4.9493 4.5602 3.0454 3.5784 1.2969 1.8541 1.7478 1.6485 1.6890 1.6505 1.3724 1.4206 1.6998 1.7313 1.8472 1.8362 1.3650 3.6213 1.3675 7.1355 3.7248 1.4194 2.0873 2.0838 1.7299 1.7306 1.1316 1.7449 1.7455 1.6841 1.2563 1.7973 4.3598 1.3587 1.4035 1.2702 1.4352 1.4440 1.5300 1.5584 1.2167 1.2167 6.3398 1.2256 1.2272 3.8742 1.0680 1.0669 1.0449 1.0448 1.0664 1.0657 1.0480 1.0481 1.0946 1.0595 2.3938 8.5996 10.6851 10.6851 6.7505 1.0359 1.0359 1.0372 1.0372 1.0785 1.0784 1.0616 1.0617 1.1060 1.1059 1.0997 1.0997 1.1009 1.1009 1.0992 1.0992 1.0993 1.0993 1.0884 1.0886 1.0969 1.0971
irintensity: 0.0026 0.6134 0.0149 0.2189 0.0456 0.0025 0.0775 0.3267 1.8233 0.1767 0.3652 6.8278 0.3035 0.0027 2.1754 1.2996 0.7935 2.3396 10.7193 7.0393 2.6037 10.2206 1.7732 0.3547 0.0308 0.0094 8.1573 1.4863 0.6314 6.3099 0.8120 1.1676 1.6524 0.0000 0.0162 66.0657 1.7723 0.0063 1.7831 2.0518 14.2150 5.0113 8.0241 3.9531 35.7030 1.2732 2.7295 1.5542 41.1873 8.0937 31.8628 50.1201 17.9857 0.0008 113.7532 0.0002 183.5571 434.9278 1.0218 22.2977 5.6599 2.9062 6.6804 17.0848 3.4698 4.6136 334.1501 3.4365 345.7807 155.9322 7.2769 2.7433 0.6463 5.3433 0.5491 13.0029 2.9315 17.7000 26.4557 0.0154 21.7291 6.9753 26.5784 2.2743 2.0101 3.2985 0.0027 5.2768 10.0860 24.8213 3.0817 4.3927 38.9430 1.7613 53.6249 244.9086 94.6679 34.0137 48.6046 16.4390 33.1054 16.5352 6.4707 7.5567 43.3647 16.3376 3.0891 2.8845 19.9771 13.3817 46.2463 111.8659 15.2045 77.8719 65.6740 25.2490 0.1309 0.5353 2.3377 1.6690
temp: 298.150 k
press: 1.00000 atm
elementType: 8 8 8 8 6 6 6 6 6 6 6 6 6 6 6 6 6 6 6 6 1 1 1 1 1 1 1 1 1 1 1 1 1 1 1 1 1 1 1 1 1 1
symmnumber: 1
zpe: 911533.8 jmol-1
zpe.correction: 0.347185 hartree
zpe.thermalcorrener: 0.369343 hartree
zpe.thermalcorrenthalpy: 0.370288 hartree
zpe.thermalcorrgfe: 0.292556 hartree
zpe.sumelectzpe: -922.297786 hartree
zpe.sumelectthermal: -922.275627 hartree
zpe.sumelectthermalent: -922.274683 hartree
zpe.sumelectthermalfe: -922.352415 hartree
dipole: -0.0004 -4.2329 -0.0012
dipole: 4.2329
quadrupole: -101.5550 -125.4705 -120.4574
quadrupole: -0.0041 0.9150 -0.0004
quadrupole: 14.2727 -9.6429 -4.6298 -0.0041 0.9150 -0.0004
hfenergy: -922.6449707 hartree
pointgroup: C01 [X(C16H22O4)]
dipole: 0.0021707 -1.6652214 0.0191101 debye
polarizability: 289.877685|0.2151786|189.7970119|9.2657402|-0.8051793|116.5415884 unknown
InChI: InChI=1S/C16H22O4/c1-11(2)9-19-15(17)13-5-7-14(8-6-13)16(18)20-10-12(3)4/h5-8,11-12H,9-10H2,1-4H3
charge 0 multiplicity 1
42 atoms
O  -3.476786 -0.241459 -0.200987
O  3.476699 -0.229896 0.154753
O  -3.585508 2.086127 -0.246099
O  3.580083 2.098337 0.147371
C  -5.392783 -1.761085 -0.210236
C  5.397386 -1.743514 0.196796
C  -4.966723 -0.28868 -0.282706
C  4.966675 -0.271262 0.23952
C  -4.996848 -2.400441 1.139863
C  -6.918244 -1.855906 -0.456051
C  5.004006 -2.411277 -1.140186
C  6.923019 -1.828391 0.445052
C  -1.413501 0.978422 -0.113129
C  1.410619 0.98314 0.037794
C  -2.904924 1.03094 -0.19252
C  2.901932 1.040713 0.116995
C  -0.704591 2.208099 -0.088757
C  0.699088 2.21045 -0.013652
C  -0.702948 -0.249299 -0.062101
C  0.702836 -0.246969 0.013422
H  -4.870093 -2.301387 -1.025206
H  4.876139 -2.26899 1.022331
H  -5.274767 0.187368 -1.232206
H  -5.38318 0.303867 0.554184
H  5.271747 0.224438 1.179896
H  5.382584 0.306033 -0.608219
H  -5.269327 -3.471434 1.161022
H  -5.521157 -1.900915 1.977483
H  -3.910625 -2.315422 1.316705
H  -7.248792 -2.909443 -0.425351
H  -7.200923 -1.438958 -1.440711
H  -7.480368 -1.305362 0.322619
H  5.28165 -3.481176 -1.139974
H  5.525768 -1.926123 -1.987765
H  3.917366 -2.334996 -1.318351
H  7.256908 -2.881273 0.436155
H  7.203922 -1.390556 1.421124
H  7.483852 -1.292117 -0.344421
H  -1.274179 3.141925 -0.129428
H  1.266717 3.14613 0.006513
H  -1.260814 -1.189116 -0.083537
H  1.262784 -1.184842 0.055395
