program: Gaussian 09
title: 000029442
version: EM64L-G09RevD.01
frameworkgroup: C1[X(C14H18N2)]
method: RPBEPBE
basis: SDD
operation: Freq
keyword: #pfreq=noraman
keyword: PBEPBE/SDD
title: #p freq=noraman PBEPBE/SDD
converged: YES YES NO NO
title: Mulliken charges:
elementType: N N C C C C C C C C C C C C C C H H H H H H H H H H H H H H H H H H
charge: -0.125361 -0.457792 -0.133366 -0.501078 -0.421855 -0.401466 0.268446 0.096082 0.121025 -0.646432 0.204263 -0.392325 -0.798585 -0.368428 -0.264544 -0.222262 0.175801 0.246425 0.208046 0.204633 0.224345 0.170278 0.227495 0.222641 0.177999 0.250564 0.296473 0.264818 0.232323 0.239174 0.245255 0.223957 0.216435 0.217014
chargesum: 0.00000
title: Mulliken charges with hydrogens summed into heavy atoms:
elementType: N N C C C C C C C C C C C C C C
charge: -0.125361 -0.161319 0.042436 -0.046606 0.007123 -0.003693 0.268446 0.096082 0.121025 0.004771 0.204263 -0.127506 -0.081833 -0.144471 -0.048109 -0.005248
polarizability: 1.94499938e+02 -9.67277078e+00 1.86538944e+02 1.97720466e+00 3.02793704e-01 1.06485666e+02
1716.lowfreq: -9.9969 -8.0487 -0.0004 0.0000 0.0004 3.7957 34.9240 57.7212 75.0068
frequency: 34.8555 57.6888 74.9898 87.5463 114.4749 125.3112 154.8847 190.8966 221.2108 233.2669 279.1995 291.3090 309.6886 364.1105 423.6140 433.2997 478.1325 494.8837 501.8655 557.2258 578.2487 596.6279 624.6772 655.9300 661.7362 719.6303 751.0804 763.1086 782.6731 854.5521 854.9965 868.2033 886.1172 916.3476 934.4611 941.7822 964.9370 975.1041 991.8945 1010.6454 1037.0794 1040.9516 1046.6031 1086.1200 1102.9997 1107.6688 1142.0279 1149.5105 1167.9730 1181.4036 1200.9270 1213.0454 1232.9806 1243.0809 1250.6520 1255.9485 1284.2265 1304.4272 1306.5057 1335.1993 1339.5139 1358.5938 1397.7427 1412.3511 1425.3032 1429.1435 1463.4076 1465.0613 1466.8709 1467.8291 1472.1755 1474.3008 1480.7762 1482.0808 1491.0571 1578.2940 1596.4195 1631.8900 2791.3757 2824.8079 2847.4488 2965.0730 3009.8349 3022.4880 3024.7261 3033.4217 3034.1273 3065.3336 3084.0791 3090.5983 3093.3115 3119.6436 3131.4637 3150.4814 3165.3066 3603.5661
redmass: 3.0292 2.4630 2.4170 1.2709 2.3222 3.0306 2.3526 3.7271 1.8408 1.4499 3.1195 3.8328 2.9211 3.9333 3.7854 3.0417 4.6390 1.4944 2.2672 3.3126 3.1927 4.2856 4.0959 4.8632 4.1588 3.0007 1.3566 4.0968 1.6305 1.6517 2.7406 3.0265 1.9738 2.5742 1.3799 2.7569 2.0501 1.3113 1.7978 2.0152 2.2307 1.6248 2.1691 2.3808 1.9397 1.2777 1.7649 1.5728 1.2164 1.5736 1.5864 2.5076 1.4233 1.5945 1.8436 1.3482 1.2294 2.3398 1.7233 2.0592 1.4915 1.4668 1.4053 3.0149 1.1763 2.7717 2.1984 1.3556 1.0821 1.0747 1.2133 1.0590 1.1179 2.4098 1.1042 6.5745 6.3255 6.7382 1.0792 1.0706 1.0587 1.0391 1.0597 1.0679 1.0715 1.0978 1.0821 1.1047 1.1005 1.1049 1.0951 1.0851 1.0902 1.0955 1.0984 1.0803
irintensity: 0.0667 0.4822 1.1110 0.0651 0.3774 2.8889 1.2142 0.8233 1.9273 0.3433 4.7909 1.1383 3.1465 1.4046 0.3448 7.1268 0.5221 56.0229 26.3036 0.4295 11.1169 12.1047 0.1918 1.5509 9.8480 4.0612 92.4741 3.1392 0.6388 1.1447 0.2911 10.5076 12.6119 3.5140 2.8122 9.7693 6.2665 0.5004 4.7644 15.0656 2.0243 4.7198 36.8912 1.0658 3.3251 6.5344 10.7164 8.5035 2.7444 5.1329 10.0478 31.6501 6.4384 14.9866 0.8465 6.6552 4.6675 27.8394 4.4913 7.3180 10.2843 5.4000 1.3787 29.8231 8.1975 35.8516 13.6669 29.8033 14.3175 4.6984 10.4285 4.9029 8.7095 7.3290 3.9139 8.0425 10.7150 5.5270 62.4999 95.2574 215.8520 66.8852 26.7245 51.4334 40.0437 21.3594 53.4716 2.6432 27.0052 53.7747 17.1637 0.3322 20.9495 31.5643 20.5026 45.2472
temp: 298.150 k
press: 1.00000 atm
elementType: 7 7 6 6 6 6 6 6 6 6 6 6 6 6 6 6 1 1 1 1 1 1 1 1 1 1 1 1 1 1 1 1 1 1
symmnumber: 1
zpe: 759272.4 jmol-1
zpe.correction: 0.289192 hartree
zpe.thermalcorrener: 0.304115 hartree
zpe.thermalcorrenthalpy: 0.305059 hartree
zpe.thermalcorrgfe: 0.246874 hartree
zpe.sumelectzpe: -652.613091 hartree
zpe.sumelectthermal: -652.598168 hartree
zpe.sumelectthermalent: -652.597224 hartree
zpe.sumelectthermalfe: -652.655409 hartree
dipole: -0.3064 3.0630 0.0598
dipole: 3.0789
quadrupole: -86.5568 -84.9149 -99.3977
quadrupole: 5.7814 0.4616 0.0408
quadrupole: 3.7330 5.3749 -9.1079 5.7814 0.4616 0.0408
hfenergy: -652.9022829 hartree
pointgroup: C01 [X(C14H18N2)]
dipole: 0.1900989 1.1822346 0.1829968 debye
polarizability: 194.9293129|7.7801581|183.3470468|9.1799584|12.7078601|109.2481886 unknown
InChI: InChI=1S/C14H18N2/c1-10-14(13-8-5-9-16(13)2)11-6-3-4-7-12(11)15-10/h3-4,6-7,13,15H,5,8-9H2,1-2H3
charge 0 multiplicity 1
34 atoms
N  2.148096 -0.570058 -0.739509
N  -1.744265 1.909226 0.188103
C  1.662119 0.355135 0.330387
C  2.018863 -0.430738 1.63319
C  3.23554 -1.334031 1.245778
C  3.466466 -1.048083 -0.262628
C  0.208458 0.723233 0.187709
C  -0.897515 -0.196543 -0.04769
C  -0.344528 2.002973 0.324461
C  2.148707 -0.005813 -2.096451
C  -2.110747 0.577779 -0.04013
C  -0.979994 -1.59676 -0.274376
C  0.297916 3.336045 0.590372
C  -3.38312 -0.000503 -0.238068
C  -2.247338 -2.181995 -0.468397
C  -3.436503 -1.394539 -0.448947
H  2.27418 1.298253 0.316543
H  1.154599 -1.041984 1.941871
H  2.247794 0.266019 2.458375
H  4.137726 -1.103924 1.839445
H  2.991051 -2.39786 1.406883
H  4.257123 -0.260912 -0.386591
H  3.788109 -1.939058 -0.831379
H  2.47489 -0.773775 -2.820631
H  2.826822 0.880806 -2.201704
H  1.125752 0.308442 -2.36572
H  -2.385104 2.697772 0.245052
H  -0.061647 -2.189957 -0.317839
H  0.016259 4.08651 -0.173818
H  0.009569 3.744133 1.579057
H  1.395948 3.244025 0.578741
H  -4.298206 0.602984 -0.23034
H  -2.325252 -3.260933 -0.644694
H  -4.407068 -1.87917 -0.605454
