program: Gaussian 09
title: 000029260
version: EM64L-G09RevD.01
frameworkgroup: C1[X(C20H22ClNO)]
method: RPBEPBE
basis: SDD
operation: Freq
keyword: #p
keyword: freq=noraman
keyword: PBEPBE/SDD
title: #p freq=noraman PBEPBE/SDD
converged: YES YES NO NO
title: Mulliken charges:
elementType: Cl O N C C C C C C C C C C C C C C C C C C C C H H H H H H H H H H H H H H H H H H H H H H
charge: -0.073566 -0.316958 -0.087260 -0.006644 -0.576675 -0.479713 -0.439656 0.301648 0.278586 0.391203 0.388440 -0.405015 -0.390016 -0.465888 -0.471267 -0.275278 -0.100296 -0.255040 -0.225594 -0.234307 -0.392213 -0.613841 -0.614644 0.244465 0.243219 0.239919 0.230480 0.234813 0.302233 0.254106 0.246650 0.242798 0.224228 0.202499 0.226147 0.252312 0.225711 0.193745 0.223104 0.189842 0.221414 0.229596 0.222080 0.225112 0.189523
chargesum: 0.00000
title: Mulliken charges with hydrogens summed into heavy atoms:
elementType: Cl O N C C C C C C C C C C C C C C C C C C C C
charge: -0.073566 -0.316958 -0.087260 -0.006644 -0.332210 0.003425 0.025636 0.301648 0.278586 0.391203 0.388440 -0.102782 -0.135910 -0.219238 -0.228470 0.151449 -0.100296 -0.028892 0.026718 -0.008596 0.024636 0.027010 0.022071
polarizability: 2.55767342e+02 -7.06437783e+00 2.61659552e+02 1.40173855e+01 2.79336734e-01 1.67240234e+02
1716.lowfreq: -11.5640 -0.0015 -0.0011 -0.0010 6.6317 8.0903 21.9970 33.0059 45.0605
frequency: 21.0581 32.7637 45.0562 51.4630 95.5566 101.4932 126.4322 126.9071 151.2928 180.6968 194.5833 203.2908 218.4076 224.4183 230.6618 238.0999 251.4989 302.1909 328.0318 351.3389 360.9861 379.0612 397.9829 419.4924 429.3683 442.5308 456.3248 477.1285 492.5562 535.2182 555.6964 594.9335 600.6532 622.6583 633.4962 679.5664 734.2892 751.7145 762.4062 774.4768 797.5077 815.7528 824.2530 826.1368 841.2727 851.0820 878.4336 887.5510 895.9526 912.9667 945.4184 947.5858 957.0656 985.4470 1003.8007 1023.6412 1029.2989 1033.2392 1034.5847 1036.6546 1049.4836 1065.4362 1073.2934 1087.5597 1093.6996 1107.2471 1131.3781 1139.6485 1142.5121 1160.9915 1170.6858 1172.3800 1179.2293 1191.5340 1196.8492 1212.2699 1239.5990 1242.6089 1252.8856 1267.3988 1268.1687 1288.5711 1300.0125 1303.9156 1322.5301 1331.5860 1386.3755 1388.2584 1390.2863 1405.5478 1420.3985 1443.2222 1443.7313 1450.6142 1462.0934 1462.1960 1466.1223 1467.2004 1475.7499 1477.1836 1484.1417 1485.9610 1498.7416 1584.1136 1594.0621 1607.0692 1617.5419 2849.4260 2856.9378 2874.5366 2971.9468 3002.5157 3016.3017 3020.3508 3026.6286 3029.6755 3052.0553 3054.2743 3060.0851 3079.3054 3083.6113 3084.6264 3120.6416 3131.2471 3133.4264 3146.8454 3161.6665 3168.9004 3186.9498
redmass: 4.2432 2.7239 6.7010 4.7892 2.8348 3.8684 4.1318 3.5538 3.6028 2.5646 2.2905 2.5651 2.8423 1.2446 3.5047 3.2099 1.7845 6.9311 3.7404 3.8391 2.6856 4.1541 3.7487 3.7900 2.7172 3.9968 3.7747 3.8365 5.4022 4.5795 4.2914 6.2284 4.6099 4.2433 5.6947 6.3776 5.5348 4.4825 1.3314 2.0322 2.4916 1.9137 1.7689 1.7430 2.7542 4.3009 1.9046 1.8762 1.9874 1.4562 1.3699 1.4346 6.4682 1.3185 4.3930 2.7259 2.5721 2.5992 1.5472 3.1421 2.9160 2.0382 2.0592 1.7651 1.7278 1.8611 1.5095 1.4807 1.4002 1.5359 1.4315 1.1435 1.9950 2.6997 1.3819 1.8788 1.2548 1.7621 1.6617 2.1343 1.7924 1.2185 1.4987 1.6563 1.4274 1.4011 1.7348 5.3783 4.2499 3.7083 1.1431 2.1889 1.2359 2.4637 1.0658 1.0746 1.6222 1.1694 1.0525 1.0769 1.3519 1.0542 1.0844 7.5720 7.3161 7.5385 7.1519 1.0570 1.0617 1.0654 1.0560 1.0580 1.0620 1.0729 1.0800 1.0883 1.0976 1.0875 1.1049 1.1008 1.1057 1.1006 1.0860 1.0893 1.0898 1.0937 1.1000 1.0955 1.0927
irintensity: 0.3102 0.5617 0.0378 0.8644 0.1416 0.8773 0.3582 1.5307 1.7488 1.0140 0.1375 0.2342 0.5671 1.9983 0.4527 2.5359 2.4333 1.8795 8.8646 2.9489 4.2327 0.8433 1.0958 0.7325 0.0806 3.0224 3.7830 9.9673 9.2192 6.5889 17.7577 11.9320 3.3839 10.8448 1.0234 5.3962 5.7761 4.6611 65.2290 11.0642 6.7154 10.5995 1.4064 35.3790 29.2157 7.1142 4.5550 0.8871 6.5139 7.9033 0.0186 0.6058 33.9958 0.2030 8.1236 0.7828 5.7870 10.5446 21.8815 7.4993 106.7277 25.5929 83.9036 14.4050 4.9772 12.8308 11.2265 1.3007 11.0483 13.6033 4.8755 0.6887 5.7481 8.0764 3.2381 23.5791 4.7403 11.9869 7.8325 12.8806 1.7926 7.8366 38.0800 2.7696 2.6785 0.8436 1.4708 1.1365 3.6570 19.7221 2.6549 11.3310 8.5479 70.7810 4.8963 13.0359 7.0070 3.0719 25.3589 12.6082 18.0450 11.9851 3.4345 6.2009 4.0982 12.0347 6.1763 67.1626 105.5341 163.2733 31.5743 28.1457 42.1772 39.4745 60.6049 11.1613 43.1086 33.9951 0.6886 26.7628 56.3548 53.0526 2.4511 8.1161 9.9252 28.3041 31.8887 6.4293 1.9439
temp: 298.150 k
press: 1.00000 atm
elementType: 17 8 7 6 6 6 6 6 6 6 6 6 6 6 6 6 6 6 6 6 6 6 6 1 1 1 1 1 1 1 1 1 1 1 1 1 1 1 1 1 1 1 1 1 1
symmnumber: 1
zpe: 970275.9 jmol-1
zpe.correction: 0.369559 hartree
zpe.thermalcorrener: 0.390426 hartree
zpe.thermalcorrenthalpy: 0.391371 hartree
zpe.thermalcorrgfe: 0.319134 hartree
zpe.sumelectzpe: -1363.665703 hartree
zpe.sumelectthermal: -1363.644835 hartree
zpe.sumelectthermalent: -1363.643891 hartree
zpe.sumelectthermalfe: -1363.716127 hartree
dipole: -1.7995 3.0751 1.3483
dipole: 3.8095
quadrupole: -129.6096 -143.0599 -143.5086
quadrupole: 11.6482 8.9160 -0.8517
quadrupole: 9.1164 -4.3339 -4.7825 11.6482 8.9160 -0.8517
hfenergy: -1364.0352614 hartree
pointgroup: C01 [X(C20H22Cl1N1O1)]
dipole: -0.6570528 -1.1905554 -0.6302012 debye
polarizability: 255.3891483|7.8572441|261.6458249|-12.9140057|7.2519497|167.6321545 unknown
InChI: InChI=1S/C20H22ClNO/c1-22(2)11-12-23-20-10-9-15(16-5-3-4-6-18(16)20)17-8-7-14(21)13-19(17)20/h3-8,13,15H,9-12H2,1-2H3
charge 0 multiplicity 1
45 atoms
Cl 3.128614 4.015773 1.344775
O  -1.079207 0.933659 -0.02764
N  -4.779025 1.448727 -0.209376
C  -0.027121 0.028747 -0.476692
C  2.017255 -1.49508 -1.135164
C  -0.030329 -0.238365 -2.034354
C  1.186911 -1.13845 -2.426007
C  1.329882 0.661403 -0.164294
C  -0.041803 -1.34626 0.21228
C  2.432375 -0.162545 -0.517349
C  1.053717 -2.171228 -0.163532
C  1.518028 1.936084 0.397297
C  -0.98679 -1.799071 1.151282
C  3.745174 0.298149 -0.305531
C  1.18134 -3.465664 0.374947
C  -2.426645 0.708659 -0.585041
C  2.844761 2.366252 0.604152
C  -0.854243 -3.100032 1.696841
C  3.961433 1.577384 0.266522
C  0.21877 -3.933414 1.304098
C  -3.387004 1.528625 0.290004
C  -5.59623 2.612476 0.190558
C  -5.444567 0.172545 0.124876
H  2.882149 -2.132651 -1.384831
H  0.013503 0.738132 -2.548796
H  -0.977096 -0.731325 -2.314794
H  0.842845 -2.072946 -2.903577
H  1.843234 -0.613421 -3.142393
H  0.657255 2.55429 0.659829
H  -1.795044 -1.137094 1.478412
H  4.604694 -0.326055 -0.574704
H  2.027065 -4.101808 0.088157
H  -2.483649 1.069045 -1.629952
H  -2.679185 -0.370461 -0.567823
H  -1.581659 -3.458662 2.433828
H  4.974509 1.948523 0.446344
H  0.315182 -4.937631 1.731894
H  -3.290099 1.195607 1.354148
H  -3.058064 2.583012 0.252898
H  -5.754782 2.688789 1.296409
H  -6.589504 2.548855 -0.289691
H  -5.112298 3.54409 -0.151553
H  -4.86501 -0.681357 -0.266154
H  -6.442903 0.142444 -0.346772
H  -5.577341 0.02425 1.22757
