program: Gaussian 09
title: 000029216
version: EM64L-G09RevD.01
frameworkgroup: C1[X(C10H11N3OS)]
method: RPBEPBE
basis: SDD
operation: Freq
keyword: #p
keyword: freq=noraman
keyword: PBEPBE/SDD
title: #p freq=noraman PBEPBE/SDD
converged: YES YES NO NO
title: Mulliken charges:
elementType: S O N N N C C C C C C C C C C H H H H H H H H H H H
charge: 0.239647 -0.298104 -0.164456 -0.191662 -0.388061 -0.342432 0.422682 -0.088815 -0.277734 -0.352872 -0.635246 0.279024 -0.245149 -0.205265 -0.595623 0.245929 0.251218 0.242171 0.242274 0.291816 0.231624 0.230967 0.397904 0.240124 0.255142 0.214897
chargesum: 0.00000
title: Mulliken charges with hydrogens summed into heavy atoms:
elementType: S O N N N C C C C C C C C C C
charge: 0.239647 -0.298104 -0.164456 -0.191662 0.009843 -0.342432 0.422682 -0.088815 -0.031805 -0.101654 0.141015 0.279024 -0.013524 0.025702 0.114539
polarizability: 2.41007302e+02 1.27263151e+01 1.62627160e+02 -3.80305741e-01 4.51496260e-01 6.60987301e+01
1716.lowfreq: -21.5740 -0.0005 -0.0001 0.0013 0.4863 6.0078 9.5407 50.7817 71.4316
frequency: -20.0696 50.7798 71.4313 110.1817 115.0226 159.1721 190.6761 192.7492 216.1980 248.4761 290.7294 323.5226 340.5531 378.4824 389.9774 432.2591 487.7751 498.7388 540.4998 588.9659 594.9574 660.7148 683.4001 699.0555 704.6164 729.4963 761.1367 827.9646 853.2939 862.7365 876.4118 940.2473 981.3343 1009.0182 1020.2063 1042.4115 1087.8606 1121.1963 1122.8050 1129.4090 1161.9192 1168.4537 1186.1756 1219.5972 1252.1337 1265.7907 1312.4052 1378.4038 1415.3516 1431.8868 1436.4296 1446.8548 1460.5722 1476.7350 1490.7376 1493.9258 1547.8890 1566.1995 1575.3801 1606.7927 1665.8138 2983.2423 2985.0567 3067.4768 3071.5689 3108.1957 3121.9275 3137.1970 3149.9218 3163.5022 3174.5541 3184.7284
redmass: 1.0229 4.6466 7.3457 4.1361 4.3493 3.2065 1.1319 5.5387 4.1113 4.4680 5.4470 4.0872 5.7716 7.9580 5.4700 3.1943 9.1052 5.8835 4.7236 6.6079 6.6974 7.3192 7.4219 5.3335 9.7641 2.6347 1.5262 4.0410 1.2162 1.2718 5.7524 1.3826 1.3172 4.3875 2.2754 4.9534 2.1599 1.5217 1.2951 1.2811 1.7429 1.2208 3.4430 2.9987 2.3972 2.0622 3.4646 4.9378 1.2378 1.1728 2.7838 2.7569 1.0489 1.0595 1.0521 1.0428 6.2913 1.6272 5.8993 6.4380 7.4965 1.0368 1.0347 1.0975 1.1031 1.1020 1.0982 1.0855 1.0901 1.0953 1.1004 1.0862
irintensity: 0.0346 0.0309 0.8196 11.1845 1.8823 2.0694 1.1763 0.4256 6.0899 0.4574 17.9152 7.5563 0.1018 1.9631 17.5070 9.2513 0.0757 3.8382 0.0375 1.3398 0.1640 26.2510 0.6553 0.5945 12.9773 23.7142 67.5717 30.7603 48.8325 58.9972 0.6094 3.9740 0.1366 28.2418 12.8703 35.3518 213.0652 4.5272 8.1980 0.9691 2.4585 1.2663 7.2800 104.3102 170.8003 213.2735 18.9552 0.4056 8.2610 5.1836 19.0859 54.9762 16.3500 51.4211 13.2882 21.2701 476.3512 353.3645 77.2807 26.1943 390.9453 85.4052 20.6687 29.0569 22.5614 20.0595 1.6302 1.7583 8.9663 20.0701 20.2489 458.1201
temp: 298.150 k
press: 1.00000 atm
elementType: 16 8 7 7 7 6 6 6 6 6 6 6 6 6 6 1 1 1 1 1 1 1 1 1 1 1
symmnumber: 1
zpe: 520622.5 jmol-1
zpe.correction: 0.198295 hartree
zpe.thermalcorrener: 0.211463 hartree
zpe.thermalcorrenthalpy: 0.212407 hartree
zpe.thermalcorrgfe: 0.158233 hartree
zpe.sumelectzpe: -1024.149148 hartree
zpe.sumelectthermal: -1024.135979 hartree
zpe.sumelectthermalent: -1024.135035 hartree
zpe.sumelectthermalfe: -1024.189209 hartree
dipole: 3.0603 0.6005 -0.0155
dipole: 3.1187
quadrupole: -99.6965 -81.2850 -99.2927
quadrupole: -2.9390 0.1383 -0.0484
quadrupole: -6.2717 12.1397 -5.8680 -2.9390 0.1383 -0.0484
hfenergy: -1024.3474425 hartree
pointgroup: C01 [X(C10H11N3O1S1)]
dipole: 1.2133806 0.182243 -0.0066401 debye
dipolederiv: -0.4258993 0.1124768 0.0008855 0.2407422 -0.3342287 -0.0014296 -0.0001938 -0.000474 0.0562272 -1.4253256 -0.2308737 0.0009 0.0247355 -0.6488065 -0.0024529 0.0033672 0.0005316 -0.3774874 -2.4312491 0.0588611 0.010061 0.5269461 -0.7991886 -0.0047411 0.0090375 -0.0046506 -0.1884147 -1.2598918 -0.1801664 -0.0005402 -0.4611915 -0.8831755 0.0011322 0.0003415 -0.0002802 -0.2032242 -0.745231 0.0085266 0.0072555 0.3511637 -1.0761646 -0.0224791 -0.0081053 0.0378622 -0.4429665 0.070599 0.2508329 0.0009822 0.5145971 0.1094574 0.0002295 0.0013152 0.0004288 -0.0860197 0.8240691 0.1737236 -0.0002048 -0.0728253 -0.0301557 0.0000442 -0.0002211 -0.0004029 0.0643065 2.1002105 -0.0337061 -0.0062006 0.2952616 0.8706237 -0.0013062 -0.0013526 0.0011176 0.0535199 0.05643 -0.0652211 -0.0003893 -0.1561567 0.0333271 0.0004693 -0.0003412 0.0003728 -0.1183813 -0.067286 -0.0285026 -0.0000517 -0.1040711 0.052514 0.0005146 -0.0004514 0.0005775 -0.1638316 -0.0144905 0.1362798 0.0012165 0.2507434 0.4146195 0.0012145 0.0018818 -0.0005074 0.2175177 2.1850103 0.0884552 -0.0058044 -1.0730339 1.5134463 0.0135028 -0.0109829 0.005826 0.2773721 -0.0671411 -0.047352 0.0002516 -0.0765632 -0.0265204 0.0006014 -0.0001037 0.0003408 -0.179174 -0.0339873 0.0617773 0.0004317 0.1379238 0.0766614 0.0003131 0.0003089 0.0004921 -0.1562764 0.3110019 -0.2093519 -0.0395815 -0.2348216 0.4376998 0.0299215 -0.0355895 -0.0048223 0.251898 0.0693435 0.025158 0.000015 0.0810892 -0.0437909 -0.0004777 0.0000857 -0.0004664 0.166393 0.0614984 0.0788838 0.0000879 0.0368603 -0.0410985 -0.0004594 0.0001228 -0.000399 0.1679396 0.1112672 0.079239 -0.0871898 -0.0326357 -0.0297138 0.0467473 -0.0582778 0.0725387 -0.0492867 0.1112645 0.0783364 0.0868904 -0.0334729 -0.0294284 -0.0469653 0.0570812 -0.0728379 -0.0507573 0.0210682 -0.0995261 -0.0002979 0.0331119 0.2220122 0.0006706 0.0000162 0.000452 0.1382156 -0.1314561 0.021579 0.000046 0.0157995 0.0818352 -0.0001762 -0.0000028 -0.0002028 0.1685557 -0.0089039 -0.1028839 -0.0002042 -0.1186247 -0.0402174 -0.0004129 -0.0002563 -0.0004755 0.1616684 0.6950642 -0.2368112 0.0008207 -0.1572346 0.188833 0.0019232 -0.0101741 -0.0047202 0.3042681 -0.0010559 0.1105095 0.0747156 0.0578597 0.0097846 -0.0055504 0.117824 -0.0866223 -0.1172566 -0.043681 0.0737805 -0.0957594 -0.0316932 0.0655391 -0.0570019 -0.1002896 0.0030325 0.0061833 0.0387719 -0.1240247 0.0516642 -0.0145095 -0.0938644 0.0461686 0.0349601 0.0532889 0.0990115 unknown
polarizability: 241.9860567|9.1792833|161.6442992|-0.4849015|0.7297909|66.1028358 unknown
InChI: InChI=1S/C10H11N3OS/c1-11-9(14)13(2)10-12-7-5-3-4-6-8(7)15-10/h3-6,11H,1-2H3
charge 0 multiplicity 1
26 atoms
S  0.685255 -2.095352 -0.003401
O  -4.136446 -0.260957 0.011407
N  -1.872669 -0.938461 0.000291
N  0.04867 0.531007 0.001987
N  -2.471682 1.380413 0.002649
C  2.01006 -0.848649 -0.000549
C  1.452613 0.470571 0.002162
C  -0.51792 -0.672034 -0.000514
C  3.398869 -1.06878 -0.000747
C  2.319154 1.58911 0.004828
C  -2.333939 -2.343556 -0.002205
C  -2.919933 0.090541 0.006206
C  4.250566 0.061011 0.001925
C  3.712576 1.374836 0.004687
C  -3.427896 2.491527 0.016187
H  3.816825 -2.079996 -0.002787
H  1.896139 2.598009 0.007053
H  -1.975176 -2.874121 0.8982
H  -1.979826 -2.869262 -0.907254
H  -3.433626 -2.317935 0.000721
H  5.335853 -0.08435 0.001902
H  4.390386 2.235158 0.006777
H  -1.441265 1.528317 0.006572
H  -3.877148 2.632458 1.017511
H  -4.25037 2.300239 -0.693979
H  -2.903669 3.416755 -0.27403
