program: Gaussian 09
title: 000029254
version: EM64L-G09RevD.01
frameworkgroup: C1[X(C20H25NO)]
method: RPBEPBE
basis: SDD
operation: Freq
keyword: #p
keyword: freq=noraman
keyword: PBEPBE/SDD
title: #p freq=noraman PBEPBE/SDD
converged: YES YES NO NO
title: Mulliken charges:
elementType: O N C C C C C C C C C C C C C C C C C C C C H H H H H H H H H H H H H H H H H H H H H H H H H
charge: -0.269113 -0.087670 -0.088137 0.387019 0.384986 -0.313582 0.164744 0.106509 -0.733981 -0.740772 -0.406360 -0.409783 -0.351751 -0.317211 -0.276634 -0.280139 -0.262748 -0.274601 -0.257367 -0.354203 -0.620085 -0.612343 0.248489 0.224129 0.230759 0.224488 0.234237 0.215798 0.217329 0.232589 0.231732 0.267802 0.295896 0.224903 0.223931 0.203721 0.212301 0.229215 0.230234 0.222178 0.171166 0.231824 0.185876 0.220663 0.218157 0.183889 0.231914
chargesum: 0.00000
title: Mulliken charges with hydrogens summed into heavy atoms:
elementType: O N C C C C C C C C C C C C C C C C C C C C
charge: -0.269113 -0.087670 -0.088137 0.387019 0.384986 -0.065093 0.164744 0.106509 -0.054605 -0.073408 -0.173771 -0.178051 -0.083949 -0.021315 -0.051731 -0.056208 -0.033533 -0.044367 0.158654 0.039141 0.018279 0.021617
polarizability: 2.55881896e+02 -1.41465486e+01 2.52914218e+02 2.31432714e+01 7.16999947e+00 1.46239140e+02
1716.lowfreq: -6.0614 -5.2139 -0.0005 -0.0002 -0.0001 4.8372 21.4920 24.3981 44.2840
frequency: 21.1031 24.2000 44.2615 49.3678 75.2908 88.6252 104.2222 118.5702 172.0066 195.7342 210.7318 221.2025 222.8107 230.8505 242.6911 249.2371 282.6999 294.2083 302.8917 316.2813 348.4642 354.8120 357.5876 370.9527 400.8102 406.4637 426.6297 463.6493 465.6596 532.9051 537.5188 570.6968 597.6749 602.6782 618.1593 661.1865 694.3720 738.9220 743.4186 752.0288 772.3034 775.4207 794.7704 802.5994 850.1401 873.7038 886.4928 893.1334 914.2701 922.9970 944.3274 959.3158 963.5184 968.5452 992.7432 999.4212 1012.6242 1015.7302 1034.0669 1036.3955 1044.3199 1049.3935 1081.8520 1084.4355 1088.0230 1095.2358 1097.9450 1128.8175 1133.3401 1148.9774 1175.5315 1175.9283 1178.3755 1187.6107 1213.0190 1214.5372 1228.7934 1233.8628 1269.5550 1278.9603 1284.0154 1288.5328 1306.3360 1311.6265 1359.7088 1372.2070 1376.3723 1378.8031 1382.9240 1400.7367 1416.6602 1433.3109 1434.1489 1434.4602 1455.9220 1460.5342 1460.8012 1464.3695 1468.1765 1471.4211 1475.7909 1481.1796 1482.8479 1484.3441 1488.7204 1490.9433 1578.2012 1597.6698 1609.0482 1616.0962 2830.9645 2836.1812 2854.7438 2957.5135 2964.8410 2980.1512 2994.3053 3010.1632 3017.1982 3025.3484 3040.7167 3077.7549 3079.4237 3082.6317 3083.4165 3090.7555 3093.8531 3119.6108 3120.2664 3129.8720 3130.4891 3141.0479 3142.5442 3158.0360 3159.9734
redmass: 3.6519 3.9929 3.4886 2.7739 3.4684 3.7429 3.8483 3.7380 1.4381 2.1120 1.8928 2.4447 1.3995 1.4536 1.1845 2.0799 2.3083 3.5467 3.3953 3.1494 4.9096 2.8383 3.7760 1.8965 4.9501 2.6420 2.8085 3.2221 3.3801 3.5144 3.5133 3.2975 4.0697 4.5853 6.4763 5.4798 2.9090 4.6672 2.8227 3.2619 1.4206 1.5715 2.7633 3.1094 2.2882 3.2231 1.6287 1.8180 2.5866 1.5559 2.1543 3.5452 1.4237 1.4188 1.3228 1.3369 1.2970 3.2299 1.5398 2.5188 2.6081 1.8243 1.7274 2.4641 2.0693 1.8572 1.7065 3.5568 1.4484 1.6006 1.1396 1.4347 1.1032 3.1745 2.3487 1.6584 1.4323 1.4472 2.3249 1.4545 2.8297 1.4443 1.2635 1.8669 1.2868 8.2593 1.4283 1.1778 7.2990 1.2233 1.1420 2.1528 1.9761 1.2369 1.1084 1.0552 1.0494 1.0652 1.0794 1.6389 1.0597 1.0702 1.6493 1.0610 1.3129 1.4024 7.0708 7.9053 6.0000 6.1828 1.0683 1.0580 1.0595 1.0582 1.0817 1.0340 1.0354 1.1015 1.0715 1.0716 1.0886 1.1007 1.0999 1.1003 1.1005 1.0984 1.0999 1.0845 1.0846 1.0888 1.0884 1.0942 1.0941 1.1007 1.1007
irintensity: 0.4174 0.2004 0.3667 0.8111 0.3182 0.0678 0.4515 1.1757 0.5215 0.2446 1.2358 0.1902 0.6522 0.5548 0.2206 0.3242 5.5590 3.1210 11.1853 2.8884 0.2690 0.5327 0.1730 4.9135 0.5551 0.6216 0.9017 2.3322 8.2725 7.5603 0.2924 19.5341 1.7854 2.7797 4.7596 1.9066 34.9250 6.6341 0.3952 29.3941 13.1521 90.1679 0.5726 8.3823 0.1407 5.9896 2.7520 4.2886 4.1465 0.3495 47.8470 48.1711 2.1690 2.7494 0.9903 5.1391 0.9073 66.0521 14.8841 29.1648 0.8570 27.1288 4.5409 1.4114 8.4403 12.7657 3.3107 2.0208 7.8097 2.5378 1.4475 9.4359 0.2881 11.6078 1.1173 0.8238 3.5847 6.1285 11.2430 0.8726 34.1674 4.3351 11.3989 7.4379 6.9034 1.5030 1.2252 17.3938 2.6526 13.6251 3.1510 16.6168 0.7358 5.4882 9.0515 0.1723 16.1802 5.7570 5.2419 8.6316 17.3350 11.3273 13.7681 9.0993 41.3715 14.2432 2.2047 3.2897 1.5256 1.2749 52.3567 69.0358 313.9073 57.1113 6.8611 30.1142 27.1402 21.7477 37.9265 44.0467 23.6948 24.2068 25.5548 47.7927 19.3374 54.8518 29.6694 0.5816 2.1428 11.7864 9.1638 11.2907 33.0403 48.3820 26.3785
temp: 298.150 k
press: 1.00000 atm
elementType: 8 7 6 6 6 6 6 6 6 6 6 6 6 6 6 6 6 6 6 6 6 6 1 1 1 1 1 1 1 1 1 1 1 1 1 1 1 1 1 1 1 1 1 1 1 1 1
symmnumber: 1
zpe: 1046854.0 jmol-1
zpe.correction: 0.398726 hartree
zpe.thermalcorrener: 0.420002 hartree
zpe.thermalcorrenthalpy: 0.420946 hartree
zpe.thermalcorrgfe: 0.348110 hartree
zpe.sumelectzpe: -905.446388 hartree
zpe.sumelectthermal: -905.425112 hartree
zpe.sumelectthermalent: -905.424168 hartree
zpe.sumelectthermalfe: -905.497004 hartree
dipole: 0.1517 0.2093 1.6086
dipole: 1.6293
quadrupole: -118.7559 -123.5394 -135.2016
quadrupole: 0.7827 0.4976 0.5795
quadrupole: 7.0764 2.2929 -9.3693 0.7827 0.4976 0.5795
hfenergy: -905.8451133 hartree
pointgroup: C01 [X(C20H25N1O1)]
dipole: 0.0675487 0.0710413 0.6334636 debye
polarizability: 255.9350824|-14.4738712|253.0786235|21.8603783|8.7388545|146.0215477 unknown
InChI: InChI=1S/C20H25NO/c1-20(2)17-11-7-5-9-15(17)19(22-14-13-21(3)4)16-10-6-8-12-18(16)20/h5-12,19H,13-14H2,1-4H3
charge 0 multiplicity 1
47 atoms
O  -1.321375 -1.21597 -0.786703
N  -4.110549 -0.543277 0.319071
C  2.356869 0.905606 0.300987
C  2.274411 -0.627196 0.124436
C  1.015651 1.614047 0.006246
C  -0.037051 -0.506067 -1.007146
C  1.156292 -1.278269 -0.459622
C  -0.102295 0.948954 -0.561172
C  3.436234 1.458092 -0.690252
C  2.791874 1.226769 1.767618
C  3.379403 -1.431231 0.522222
C  0.891691 3.004238 0.285009
C  1.152712 -2.689994 -0.611845
C  -1.314362 1.653152 -0.793427
C  3.375303 -2.830628 0.366663
C  -0.302831 3.707202 0.036794
C  2.247742 -3.470906 -0.200388
C  -1.422548 3.023709 -0.494872
C  -1.733375 -1.343687 0.621163
C  -3.22628 -1.691942 0.625818
C  -4.249961 0.395693 1.449009
C  -5.420111 -0.964705 -0.21576
H  0.015218 -0.525592 -2.115441
H  4.418281 0.988308 -0.501044
H  3.150295 1.2486 -1.73643
H  3.54696 2.551578 -0.576925
H  2.052848 0.832573 2.487347
H  3.773107 0.77957 2.000979
H  2.884354 2.314188 1.929542
H  4.264773 -0.957551 0.960454
H  1.743299 3.551703 0.703983
H  0.267449 -3.156644 -1.058629
H  -2.172486 1.091556 -1.181512
H  4.244353 -3.418029 0.683849
H  -0.362639 4.778224 0.26143
H  -1.153309 -2.155026 1.109354
H  -1.536223 -0.401158 1.169634
H  2.230077 -4.559319 -0.32426
H  -2.363127 3.555058 -0.677662
H  -3.385849 -2.469134 -0.144503
H  -3.479995 -2.153718 1.616917
H  -3.26198 0.782512 1.752926
H  -4.734602 -0.067231 2.348167
H  -4.862634 1.260622 1.13766
H  -6.006642 -0.073349 -0.503926
H  -6.034599 -1.55548 0.512263
H  -5.270974 -1.581453 -1.119423
