program: Gaussian 09
title: 000029205
version: EM64L-G09RevD.01
frameworkgroup: C1[X(C14H13N3O2)]
method: RPBEPBE
basis: SDD
operation: Freq
keyword: #p
keyword: freq=noraman
keyword: PBEPBE/SDD
title: #p freq=noraman PBEPBE/SDD
converged: YES YES NO NO
title: Mulliken charges:
elementType: O O N N N C C C C C C C C C C C C C C H H H H H H H H H H H H H
charge: -0.240866 -0.256008 -0.281300 -0.709347 -0.699923 0.156367 -0.332611 0.132266 0.180001 0.478750 -0.564468 -0.338018 -0.321281 -0.362041 0.536082 -0.409719 -0.424719 -0.431223 0.519746 0.251717 0.226216 0.264674 0.248252 0.267836 0.228772 0.221470 0.218157 0.216309 0.303942 0.310952 0.306159 0.303860
chargesum: 0.00000
title: Mulliken charges with hydrogens summed into heavy atoms:
elementType: O O N N N C C C C C C C C C C C C C C
charge: -0.240866 -0.256008 -0.281300 -0.094453 -0.089904 0.156367 0.145321 0.132266 0.180001 0.478750 -0.299794 -0.089766 -0.053445 -0.133270 0.536082 -0.188249 -0.206562 -0.214915 0.519746
polarizability: 3.33798491e+02 -7.12491621e+00 1.64731491e+02 3.09901523e+00 -5.58326436e+00 9.69152910e+01
1716.lowfreq: -4.9914 -2.6272 -0.0002 0.0004 0.0005 8.2218 29.9481 50.9189 60.9447
frequency: 29.8236 50.8938 60.9430 108.2800 140.1493 162.0752 176.9247 226.2612 242.8806 260.6141 325.6540 325.9898 340.9082 360.0000 362.7857 367.9871 373.7771 394.2711 408.8642 411.1903 439.8632 446.5505 497.0023 503.9892 518.4906 550.4599 583.2474 636.9909 659.5615 687.3482 709.3713 718.7112 746.0008 761.0521 782.5592 801.5425 817.1685 821.7168 828.2840 900.4996 916.5157 919.3398 938.9173 947.0976 957.3624 997.7817 1017.8781 1022.8244 1044.3855 1076.7937 1105.2423 1136.2231 1152.7546 1178.7643 1194.5838 1216.9029 1257.5862 1263.8048 1305.2399 1320.1802 1322.2175 1338.2207 1380.6343 1394.8185 1405.4640 1443.8389 1452.1788 1465.0301 1490.0514 1519.0475 1575.2408 1583.0391 1594.9178 1633.7340 1636.5462 1646.0310 1649.0844 2950.5053 3117.2992 3123.0100 3125.7671 3127.1674 3142.2390 3142.8681 3167.3671 3186.7345 3568.7745 3572.1571 3709.0710 3712.7835
redmass: 6.1033 3.8057 5.5357 4.7065 5.3780 4.8512 6.1747 5.7217 4.7343 3.0657 1.2640 3.2363 1.2494 2.0737 1.0492 1.7644 4.1566 3.7640 2.8667 3.2264 4.4840 5.1570 5.0201 7.1812 2.9743 3.6792 4.3065 6.6884 6.7429 4.3280 4.9081 4.1841 5.7074 4.6790 4.2934 1.3640 1.5629 1.8960 4.5157 1.6361 3.6745 1.3658 1.3593 1.4007 6.6234 2.9859 1.4794 1.7916 2.0212 1.9886 3.0513 1.2530 1.5349 2.1355 1.1766 1.9556 1.4731 1.7363 2.1755 1.4720 2.5507 3.3367 3.6839 4.0825 2.1970 3.6940 4.1835 1.1528 3.1768 3.0003 7.9262 7.4433 9.0483 1.9099 1.5822 2.0149 2.6597 1.0689 1.0884 1.0952 1.0903 1.0893 1.0916 1.0963 1.0953 1.0946 1.0448 1.0449 1.1040 1.1041
irintensity: 3.6795 0.0924 2.8398 5.7682 0.3363 5.4666 0.1843 0.8142 6.1052 5.7183 196.2672 7.4209 294.5602 85.9547 12.0335 59.6006 1.7415 6.1418 1.0260 1.9622 4.2704 1.2936 7.4476 6.6567 23.6122 12.8025 10.4350 0.7467 2.3154 9.3494 7.7953 9.5916 29.1541 6.8555 8.5566 8.6081 56.8573 53.1368 21.8075 25.8527 5.6228 0.5499 1.3822 3.0739 58.8346 0.5014 4.1235 45.1332 2.9960 4.3814 10.5580 9.9550 45.9688 16.2617 35.2201 24.6139 115.9643 10.7401 237.5806 31.3286 63.6899 28.3336 35.0237 34.6410 84.2796 3.9395 100.3013 7.1718 227.3489 246.6769 185.8839 42.8623 56.5162 4.4579 27.0813 445.1972 47.4188 70.8097 31.9089 5.3020 31.1422 18.6318 12.2697 16.1299 10.4830 1.1396 106.7995 75.5854 20.5416 21.1970
temp: 298.150 k
press: 1.00000 atm
elementType: 8 8 7 7 7 6 6 6 6 6 6 6 6 6 6 6 6 6 6 1 1 1 1 1 1 1 1 1 1 1 1 1
symmnumber: 1
zpe: 650090.8 jmol-1
zpe.correction: 0.247607 hartree
zpe.thermalcorrener: 0.263923 hartree
zpe.thermalcorrenthalpy: 0.264867 hartree
zpe.thermalcorrgfe: 0.204057 hartree
zpe.sumelectzpe: -854.665853 hartree
zpe.sumelectthermal: -854.649536 hartree
zpe.sumelectthermalent: -854.648592 hartree
zpe.sumelectthermalfe: -854.709403 hartree
dipole: -0.5363 0.8816 -0.6139
dipole: 1.2007
quadrupole: -51.6751 -107.4441 -112.9861
quadrupole: -6.4330 -1.3932 -6.7111
quadrupole: 39.0267 -16.7424 -22.2843 -6.4330 -1.3932 -6.7111
hfenergy: -854.9134593 hartree
pointgroup: C01 [X(C14H13N3O2)]
dipole: -0.2083835 -0.353875 0.2334213 debye
polarizability: 333.6588541|8.8649534|165.0935573|-2.0306164|-4.1538027|96.6928621 unknown
InChI: InChI=1S/C14H13N3O2/c15-9-1-4-11(5-2-9)17-8-19-13-6-3-10(16)7-12(13)14(17)18/h1-7H,8,15-16H2
charge 0 multiplicity 1
32 atoms
O  1.14557 -2.022307 -0.534226
O  0.146389 1.896811 0.397495
N  -0.487232 -0.369885 0.215428
N  5.320101 1.684095 0.365928
N  -6.108059 0.462552 -0.235636
C  1.88352 0.213919 0.175293
C  0.01001 -1.753571 0.354156
C  0.462528 0.67149 0.298188
C  2.18745 -1.087843 -0.303206
C  -1.905643 -0.134534 0.12269
C  2.931627 1.1353 0.397166
C  3.515152 -1.452087 -0.595815
C  -2.422244 0.926047 -0.666297
C  -2.81818 -0.979934 0.802948
C  4.279758 0.777873 0.138821
C  4.553849 -0.528469 -0.372652
C  -3.807804 1.12439 -0.778744
C  -4.208939 -0.794706 0.680855
C  -4.730662 0.264722 -0.113151
H  -0.778722 -2.456934 0.055144
H  0.341968 -1.945408 1.396968
H  2.661679 2.140885 0.739342
H  3.723597 -2.454328 -0.98197
H  -1.733773 1.602107 -1.177688
H  -2.450057 -1.779675 1.456244
H  5.588866 -0.81849 -0.590697
H  -4.184419 1.952745 -1.391146
H  -4.893507 -1.463699 1.216161
H  6.282464 1.43639 0.158988
H  5.126629 2.618569 0.712327
H  -6.475152 1.228793 -0.7916
H  -6.767167 -0.139619 0.247982
