program: Gaussian 09
title: 000029206
version: EM64L-G09RevD.01
frameworkgroup: C1[X(C15H12ClNO2)]
method: RPBEPBE
basis: SDD
operation: Freq
keyword: #p
keyword: freq=noraman
keyword: PBEPBE/SDD
title: #p freq=noraman PBEPBE/SDD
converged: YES YES NO NO
title: Mulliken charges:
elementType: Cl O O N C C C C C C C C C C C C C C C H H H H H H H H H H H H
charge: -0.051073 -0.237177 -0.241857 -0.277812 -0.114665 0.108422 0.146565 0.226159 0.478371 -0.665923 -0.298923 -0.349472 -0.332862 -0.378643 -0.132423 -0.184984 -0.224480 -0.233502 -0.246925 0.260579 0.237007 0.242797 0.246886 0.298632 0.262293 0.278772 0.231838 0.261670 0.230611 0.227460 0.232659
chargesum: 0.00000
title: Mulliken charges with hydrogens summed into heavy atoms:
elementType: Cl O O N C C C C C C C C C C C C C C C
charge: -0.051073 -0.237177 -0.241857 -0.277812 0.145914 0.108422 0.146565 0.226159 0.478371 0.060767 -0.000291 -0.087180 -0.054090 -0.146805 -0.132423 0.076686 0.006131 -0.006042 -0.014266
polarizability: 3.02248361e+02 3.39605762e+00 1.73369043e+02 3.03454833e+00 -2.62265750e+00 9.69496082e+01
1716.lowfreq: -4.4407 -0.0012 0.0009 0.0021 7.0926 8.8767 37.7821 49.0866 69.1836
frequency: 37.7531 49.0715 69.1817 107.0004 138.6685 148.3966 164.8946 177.6446 224.8632 244.0558 268.7579 300.1081 333.2763 343.4328 352.2500 401.2810 408.0075 428.0384 454.5817 501.5199 520.2617 539.2519 542.9404 597.2610 605.2959 615.2637 673.9500 685.9156 692.1739 712.5460 755.5553 766.0533 796.9271 824.8581 828.4406 856.5156 871.2539 903.2157 919.7599 952.2174 964.9517 973.1914 986.0410 991.1408 1020.3349 1042.0727 1061.7085 1078.0003 1091.2421 1105.6805 1119.7035 1154.7770 1176.2738 1200.3862 1208.9243 1218.2084 1253.1056 1281.0294 1328.3277 1343.0714 1373.1342 1384.5434 1392.5058 1396.6063 1411.0358 1444.5189 1452.9066 1464.5583 1471.5551 1487.4238 1567.6269 1588.0392 1597.7134 1607.9838 1616.4778 3002.6650 3089.1863 3103.0229 3113.4223 3130.5370 3140.6256 3153.7114 3162.6858 3168.1237 3173.1256 3181.8390 3198.3257
redmass: 7.6955 4.1490 5.7629 5.0448 6.4634 4.2126 5.5239 5.9585 1.0968 4.9315 5.1431 4.4315 5.9708 7.1148 10.8967 3.5826 3.9974 3.5613 5.4309 4.6261 4.1402 4.4286 4.0426 6.3554 6.7731 6.2388 4.9210 6.1309 1.9788 4.4313 2.9046 2.4679 3.9199 1.5554 1.2830 3.3454 5.5829 1.4381 1.4186 1.3497 1.3884 3.2579 4.5464 1.4178 3.0706 2.1676 1.7653 2.2248 1.8429 2.0944 2.3479 2.0732 1.0508 1.2077 2.8565 2.9237 1.4624 2.8223 1.3234 1.3335 2.7016 7.4781 1.3042 2.5639 3.9951 2.3222 2.5810 1.0601 1.0883 2.2168 8.5632 6.8038 8.9240 6.7953 7.1941 1.0357 1.0917 1.0989 1.0987 1.0849 1.0891 1.0938 1.0888 1.0999 1.0927 1.0977 1.0951
irintensity: 1.4353 0.1868 0.0737 0.5921 2.0396 1.9821 1.1143 1.4713 0.3677 1.4516 2.0309 0.2430 0.2638 6.7929 1.6145 3.2115 0.7328 6.3832 12.7448 14.3039 2.3660 8.1700 6.5115 34.9189 30.3455 2.6183 10.0059 11.1544 34.6461 11.6726 13.7692 60.5006 22.4181 44.9435 4.1172 25.9293 4.3699 2.6559 12.1317 1.6729 0.1633 14.6781 0.2259 0.4261 21.4286 8.4866 9.9668 36.4767 7.3847 19.0632 28.3352 37.6655 0.2257 4.1120 35.5806 40.0700 60.0756 402.4659 6.8852 52.8888 42.6557 2.5583 35.1683 36.8960 206.6348 10.2005 122.1989 3.4629 3.3184 105.3045 63.6454 18.5053 93.2764 50.1919 26.7842 6.7873 1.8975 23.9077 21.1202 2.7756 7.5795 34.8911 0.8658 23.0199 3.0212 3.6866 1.0449
temp: 298.150 k
press: 1.00000 atm
elementType: 17 8 8 7 6 6 6 6 6 6 6 6 6 6 6 6 6 6 6 1 1 1 1 1 1 1 1 1 1 1 1
symmnumber: 1
zpe: 611797.2 jmol-1
zpe.correction: 0.233021 hartree
zpe.thermalcorrener: 0.248754 hartree
zpe.thermalcorrenthalpy: 0.249698 hartree
zpe.thermalcorrgfe: 0.189479 hartree
zpe.sumelectzpe: -1242.732533 hartree
zpe.sumelectthermal: -1242.716800 hartree
zpe.sumelectthermalent: -1242.715856 hartree
zpe.sumelectthermalfe: -1242.776076 hartree
dipole: 2.0961 4.0107 -0.0553
dipole: 4.5258
quadrupole: -108.0401 -113.8131 -119.4977
quadrupole: -3.8694 2.8167 6.1379
quadrupole: 5.7435 -0.0295 -5.7140 -3.8694 2.8167 6.1379
hfenergy: -1242.9655547 hartree
pointgroup: C01 [X(C15H12Cl1N1O2)]
dipole: 0.7060776 -1.6341842 0.0365731 debye
polarizability: 301.1060547|-12.7577478|174.5521924|0.2329273|-2.7478868|96.9087649 unknown
InChI: InChI=1S/C15H12ClNO2/c1-10-17(12-5-3-2-4-6-12)15(18)13-9-11(16)7-8-14(13)19-10/h2-10H,1H3
charge 0 multiplicity 1
31 atoms
Cl -5.325217 1.834323 -0.450238
O  -0.7452 -1.872258 0.771253
O  0.116756 1.938696 -0.644872
N  0.852873 -0.242888 -0.108526
C  0.442562 -1.672948 -0.095859
C  -1.54316 0.255893 -0.137872
C  -0.142008 0.73479 -0.348728
C  -1.800842 -0.994998 0.481893
C  2.254616 0.076079 0.00688
C  0.162111 -2.236534 -1.499198
C  -2.624826 1.124979 -0.423736
C  -3.108444 -1.368924 0.855831
C  2.672706 1.322088 0.547452
C  3.238421 -0.871806 -0.383662
C  -3.923999 0.729713 -0.077349
C  -4.181564 -0.500393 0.570449
C  4.045961 1.599781 0.697212
C  4.61125 -0.585322 -0.219581
C  5.025345 0.651394 0.320074
H  1.228433 -2.244708 0.419198
H  1.052898 -2.120945 -2.140315
H  -0.091863 -3.307601 -1.429131
H  -0.673977 -1.704712 -1.984015
H  -2.409083 2.094875 -0.881089
H  -3.274752 -2.33061 1.348778
H  1.929785 2.068091 0.833138
H  2.953776 -1.826768 -0.836686
H  -5.204396 -0.77735 0.841157
H  4.350636 2.564901 1.1164
H  5.354308 -1.329451 -0.526682
H  6.090396 0.875112 0.440924
