program: Gaussian 09
title: 000029258
version: EM64L-G09RevD.01
frameworkgroup: C1[X(C20H22ClNO)]
method: RPBEPBE
basis: SDD
operation: Freq
keyword: #p
keyword: freq=noraman
keyword: PBEPBE/SDD
title: #p freq=noraman PBEPBE/SDD
converged: YES YES NO NO
title: Mulliken charges:
elementType: Cl O N C C C C C C C C C C C C C C C C C C C C H H H H H H H H H H H H H H H H H H H H H H
charge: -0.073553 -0.315833 -0.086581 -0.004355 -0.577850 -0.476721 -0.440242 0.300568 0.278511 0.392848 0.385564 -0.426770 -0.387883 -0.449077 -0.470664 -0.277920 -0.223470 -0.255727 -0.100473 -0.234623 -0.391681 -0.613728 -0.614646 0.244453 0.242743 0.238682 0.231080 0.235606 0.282699 0.253085 0.267830 0.243389 0.224089 0.203883 0.252803 0.226052 0.226047 0.192402 0.222241 0.229075 0.221768 0.189489 0.189089 0.225110 0.222696
chargesum: 0.00000
title: Mulliken charges with hydrogens summed into heavy atoms:
elementType: Cl O N C C C C C C C C C C C C C C C C C C C C
charge: -0.073553 -0.315833 -0.086581 -0.004355 -0.333398 0.004703 0.026445 0.300568 0.278511 0.392848 0.385564 -0.144071 -0.134798 -0.181247 -0.227276 0.150052 0.029333 -0.029676 -0.100473 -0.008576 0.022962 0.026603 0.022249
polarizability: 2.82832321e+02 -1.15562662e+01 2.39914996e+02 1.02252204e+01 1.30863628e+00 1.64024653e+02
1716.lowfreq: -2.6228 -0.0015 -0.0008 0.0010 5.2699 9.5180 22.8241 27.1730 44.5333
frequency: 22.6434 26.9397 44.5282 53.1432 93.0151 103.5246 123.8117 134.6274 150.6466 182.0921 192.7424 200.7549 216.1959 222.6619 230.5373 244.2568 250.3980 296.9499 328.6146 353.7346 363.2611 373.6678 395.7362 420.4201 427.6120 446.7577 460.4449 482.3930 502.7497 522.6573 561.7840 581.0382 594.6894 613.7930 650.5001 681.6348 733.1530 747.1548 764.1836 780.6871 800.4308 813.7916 824.8644 834.0075 841.0870 855.8776 870.3034 882.6646 893.5394 896.6596 948.0043 956.8540 963.3018 985.9296 999.9794 1023.5361 1028.2218 1030.4514 1033.9202 1037.2952 1050.8773 1065.7769 1073.8735 1087.1250 1093.6222 1106.2243 1128.1105 1139.0770 1143.8320 1161.8973 1170.1653 1171.3486 1178.5090 1190.8777 1196.1365 1212.7856 1240.0168 1242.1011 1261.0415 1266.6247 1267.7187 1288.6363 1298.8058 1303.0655 1320.3191 1331.5014 1381.1863 1387.3239 1391.8593 1405.5136 1419.7517 1442.9168 1444.3221 1452.7191 1462.2247 1463.6818 1466.0279 1466.9693 1476.0461 1476.6683 1484.0789 1485.4956 1496.0108 1584.5555 1595.0742 1606.9532 1617.6176 2848.6532 2855.6802 2872.5297 2969.1890 3002.6270 3016.3123 3020.3553 3025.3972 3028.9780 3050.8684 3055.8805 3060.1187 3079.1710 3083.4897 3084.0951 3121.5706 3131.8050 3146.8956 3156.8453 3160.4531 3162.0268 3179.9916
redmass: 3.8039 2.9463 6.2612 4.8104 2.8166 4.2208 2.8216 4.9005 3.5907 2.7356 2.5752 4.1742 2.4246 1.1730 2.5526 5.4666 1.5188 5.8971 3.7319 2.6021 4.5729 3.7100 4.0854 3.4579 2.7204 3.5836 3.8285 4.5410 5.7236 4.5699 4.5391 4.8032 5.0176 4.3967 5.6205 6.3769 5.6936 3.8351 1.3189 1.9820 2.9081 1.6731 2.0339 1.6054 3.3605 3.7054 1.8265 1.5531 1.7652 2.1544 1.4276 6.3032 1.3826 1.3206 4.4010 2.5392 2.5840 2.5922 1.5656 3.1034 3.4507 2.0599 1.8580 1.7797 1.7245 1.7718 1.5154 1.4739 1.3788 1.4200 1.4577 1.1474 1.9881 2.7217 1.3957 1.9795 1.7050 1.2857 2.1570 2.4247 1.3906 1.2229 1.5410 1.4949 1.4328 1.4118 5.6704 1.5338 6.9667 4.0136 1.1428 1.1745 2.4147 2.4439 1.0514 1.0957 1.3371 1.3714 1.0735 1.0614 1.3481 1.0552 1.0840 7.4862 7.2703 7.7311 7.2504 1.0570 1.0624 1.0645 1.0565 1.0581 1.0621 1.0729 1.0835 1.0851 1.0971 1.0875 1.1050 1.1009 1.1054 1.1011 1.0858 1.0892 1.0936 1.0927 1.0888 1.1000 1.0965
irintensity: 0.2796 0.4704 0.3131 0.1731 0.5124 0.6421 2.0022 0.4945 2.3303 0.3627 1.3998 0.0291 0.2763 1.6015 1.3959 3.2108 1.3302 0.8988 8.8759 4.5233 3.2258 3.0992 2.1676 2.1962 0.6046 1.5433 7.1730 1.6866 16.3339 2.6939 17.5705 8.1994 9.5679 2.7359 5.2200 1.3737 7.5145 11.9887 51.4228 15.3988 4.0095 6.2876 5.3968 46.7847 17.0752 18.7770 20.9276 2.7450 3.7247 3.9464 2.4895 9.5581 1.3223 0.3461 13.4531 8.6661 4.4069 8.7923 17.4839 6.6451 152.3875 18.8412 50.6527 16.5827 7.1213 5.4711 20.7540 0.8405 17.2306 16.1177 1.7078 0.9904 5.9340 9.1285 1.4769 22.8743 5.7198 3.1934 2.5644 11.9408 2.1664 6.2634 27.2948 14.3672 4.1846 1.0070 2.5546 1.2592 1.0008 16.2128 2.9641 2.6494 23.6170 66.7732 12.7932 6.2212 6.3323 0.9037 22.9845 12.8156 17.3667 13.1645 4.6122 11.7890 9.8502 13.6592 1.6668 67.9659 97.7622 172.8007 30.4870 28.2787 40.5108 37.1518 63.6182 13.8722 43.7357 31.8166 0.5516 25.9516 65.2681 47.1195 2.1893 8.0013 27.2573 2.1941 0.9282 32.5990 4.0207
temp: 298.150 k
press: 1.00000 atm
elementType: 17 8 7 6 6 6 6 6 6 6 6 6 6 6 6 6 6 6 6 6 6 6 6 1 1 1 1 1 1 1 1 1 1 1 1 1 1 1 1 1 1 1 1 1 1
symmnumber: 1
zpe: 970212.4 jmol-1
zpe.correction: 0.369534 hartree
zpe.thermalcorrener: 0.390408 hartree
zpe.thermalcorrenthalpy: 0.391352 hartree
zpe.thermalcorrgfe: 0.319015 hartree
zpe.sumelectzpe: -1363.665743 hartree
zpe.sumelectthermal: -1363.644869 hartree
zpe.sumelectthermalent: -1363.643925 hartree
zpe.sumelectthermalfe: -1363.716262 hartree
dipole: -3.3603 1.7228 1.1138
dipole: 3.9371
quadrupole: -144.4249 -135.4520 -142.6872
quadrupole: 9.3854 9.2649 2.0842
quadrupole: -3.5702 5.4028 -1.8325 9.3854 9.2649 2.0842
hfenergy: -1364.0352772 hartree
pointgroup: C01 [X(C20H22Cl1N1O1)]
dipole: -1.2933798 0.7021008 0.4832085 debye
polarizability: 282.0076049|-13.6277443|240.5164119|8.9382293|5.0992768|164.2479526 unknown
InChI: InChI=1S/C20H22ClNO/c1-22(2)11-12-23-20-10-9-15(16-5-3-4-6-18(16)20)17-13-14(21)7-8-19(17)20/h3-8,13,15H,9-12H2,1-2H3
charge 0 multiplicity 1
45 atoms
Cl 5.503335 -2.266106 -0.850864
O  -1.191529 -1.029955 -0.051102
N  -4.910216 -1.420989 0.088411
C  -0.119873 -0.173048 0.445755
C  1.951627 1.275755 1.182553
C  -0.093401 -0.02849 2.01961
C  1.141525 0.825699 2.457006
C  1.222802 -0.793718 0.058811
C  -0.133661 1.250966 -0.133351
C  2.339354 -0.009104 0.454743
C  0.9778 2.033481 0.283906
C  1.402414 -2.019313 -0.60461
C  -1.088182 1.785199 -1.018633
C  3.649247 -0.451308 0.188525
C  1.112293 3.364018 -0.156042
C  -2.529595 -0.814443 0.53245
C  2.715325 -2.473218 -0.886569
C  -0.949347 3.12263 -1.465194
C  3.807813 -1.681542 -0.484498
C  0.139757 3.912245 -1.029083
C  -3.52017 -1.508213 -0.41506
C  -5.772978 -2.49893 -0.437007
C  -5.518082 -0.08899 -0.112048
H  2.827906 1.883339 1.46464
H  -0.05155 -1.042825 2.454952
H  -1.029284 0.450391 2.355833
H  0.817496 1.723613 3.012296
H  1.804983 0.239718 3.117329
H  0.529767 -2.607845 -0.89886
H  -1.909753 1.159944 -1.38305
H  4.520879 0.138798 0.487249
H  1.970667 3.966675 0.163469
H  -2.596322 -1.273569 1.537348
H  -2.743717 0.268977 0.62332
H  2.882639 -3.419917 -1.408271
H  -1.684734 3.544284 -2.159713
H  0.241016 4.945237 -1.380248
H  -3.405772 -1.079223 -1.442823
H  -3.233795 -2.573778 -0.479358
H  -5.333954 -3.48201 -0.192058
H  -6.76786 -2.441945 0.040556
H  -5.922126 -2.451234 -1.545853
H  -5.630987 0.181296 -1.193689
H  -6.51996 -0.067223 0.352376
H  -4.908896 0.693169 0.372746
