program: Gaussian 09
title: 000029208
version: EM64L-G09RevD.01
frameworkgroup: C1[X(C15H12ClNO2)]
method: RPBEPBE
basis: SDD
operation: Freq
keyword: #p
keyword: freq=noraman
keyword: PBEPBE/SDD
title: #p freq=noraman PBEPBE/SDD
converged: YES YES NO NO
title: Mulliken charges:
elementType: Cl O O N C C C C C C C C C C C C C C C H H H H H H H H H H H H
charge: -0.056857 -0.241317 -0.247281 -0.277225 -0.113469 0.090081 0.146221 0.489644 0.229738 -0.666574 -0.334077 -0.361743 -0.319918 -0.366661 -0.248770 -0.196570 -0.211788 -0.220712 -0.117153 0.257094 0.234444 0.242992 0.248547 0.275203 0.257331 0.287463 0.238023 0.235932 0.235492 0.257012 0.254897
chargesum: 0.00000
title: Mulliken charges with hydrogens summed into heavy atoms:
elementType: Cl O O N C C C C C C C C C C C C C C C
charge: -0.056857 -0.241317 -0.247281 -0.277225 0.143625 0.090081 0.146221 0.489644 0.229738 0.059409 -0.058873 -0.104412 -0.032456 -0.128637 -0.012838 0.038921 0.045223 0.034186 -0.117153
polarizability: 3.15845540e+02 1.03516129e+01 1.66716821e+02 4.87039608e+00 -5.78983876e+00 9.60310107e+01
1716.lowfreq: -8.8426 -3.0386 0.0012 0.0020 0.0027 2.7134 31.4656 53.1470 63.1926
frequency: 31.4318 53.1139 63.1784 112.4102 125.0924 144.7152 164.3164 212.5207 224.7103 230.8840 262.5567 286.4560 331.5440 343.9690 398.3994 409.5272 423.7767 424.4528 454.9562 495.5210 518.8340 525.6041 528.6019 559.2012 617.1400 627.7516 675.3284 692.7259 703.3760 710.7352 758.0501 780.6046 794.7042 806.8817 818.8870 838.7557 868.9162 879.4314 932.7042 955.2143 967.4731 973.8496 993.5531 994.1889 1014.1680 1035.5426 1072.8557 1080.8810 1095.8150 1111.1856 1125.6653 1151.8617 1165.2656 1198.7165 1209.9049 1226.3872 1277.5275 1287.3288 1306.2603 1339.3865 1366.8502 1388.4397 1391.9844 1398.7057 1408.0480 1447.3504 1461.0957 1463.3576 1472.5020 1483.4746 1569.5654 1581.9586 1598.1036 1603.7642 1619.8180 3001.7455 3084.8603 3100.9386 3112.8548 3138.9160 3153.2322 3153.6305 3166.8821 3167.4865 3175.7853 3177.1155 3204.8393
redmass: 7.6948 4.3611 6.6074 3.9741 6.6815 4.7621 5.5276 4.0496 1.3636 3.6112 5.5040 5.7303 4.8876 5.6280 5.3474 2.9745 7.5142 3.8498 6.5123 3.7151 4.1339 5.2452 3.7265 5.0339 6.9917 7.0113 4.3410 5.6899 3.9385 4.2037 2.6885 1.6949 4.0512 1.3605 1.7491 3.4514 3.4834 1.4955 1.3331 1.3762 1.3811 3.2182 1.8256 2.2835 2.9369 2.2078 2.0215 2.5624 2.0786 2.8516 1.5313 2.0927 1.1513 1.1437 2.7475 2.6039 2.0900 1.9873 1.3431 1.4070 3.8320 2.4498 1.3560 2.9963 3.1421 2.6471 1.4323 1.4284 1.1367 2.3267 8.3593 7.5785 7.4009 7.3996 7.2427 1.0358 1.0905 1.0991 1.0995 1.0863 1.0902 1.0878 1.0914 1.0952 1.0965 1.0999 1.0949
irintensity: 0.5211 0.3080 0.7492 0.8839 4.4939 1.1018 0.9858 0.1893 0.2199 0.6557 0.1313 4.7959 3.2335 1.7454 6.4119 0.9628 15.6255 19.6590 10.2343 19.3808 2.8342 14.6413 2.0208 1.3047 3.0411 0.6460 17.3834 17.8057 1.6400 6.3122 40.3559 52.9098 23.9731 9.3525 51.4677 15.8319 22.6723 3.6269 0.4249 0.4595 3.2628 14.1551 6.3664 22.8025 27.0409 9.4178 41.7613 51.8515 25.4382 11.8842 9.8920 39.9723 19.9842 3.2523 43.3962 10.9451 76.5661 329.5767 32.9679 104.6281 10.7544 89.2059 38.0157 37.2770 21.4546 117.9806 11.1869 1.5943 6.1517 238.7218 66.1244 0.3127 75.7468 65.2806 79.2633 7.1299 3.7037 24.6748 18.8741 3.8449 6.7796 9.8668 2.6110 9.9082 4.6161 19.3351 0.3307
temp: 298.150 k
press: 1.00000 atm
elementType: 17 8 8 7 6 6 6 6 6 6 6 6 6 6 6 6 6 6 6 1 1 1 1 1 1 1 1 1 1 1 1
symmnumber: 1
zpe: 611938.3 jmol-1
zpe.correction: 0.233075 hartree
zpe.thermalcorrener: 0.248803 hartree
zpe.thermalcorrenthalpy: 0.249748 hartree
zpe.thermalcorrgfe: 0.189402 hartree
zpe.sumelectzpe: -1242.733976 hartree
zpe.sumelectthermal: -1242.718247 hartree
zpe.sumelectthermalent: -1242.717303 hartree
zpe.sumelectthermalfe: -1242.777648 hartree
dipole: -3.1557 3.0303 0.2540
dipole: 4.3824
quadrupole: -113.2054 -111.1071 -120.7974
quadrupole: 2.7886 0.5035 5.6033
quadrupole: 1.8312 3.9296 -5.7608 2.7886 0.5035 5.6033
hfenergy: -1242.9670506 hartree
pointgroup: C01 [X(C15H12Cl1N1O2)]
dipole: -1.2157893 -1.2107197 -0.1697875 debye
polarizability: 316.2889062|-7.3605743|166.7041463|0.210839|-3.6637173|95.6003191 unknown
InChI: InChI=1S/C15H12ClNO2/c1-10-17(12-8-6-11(16)7-9-12)15(18)13-4-2-3-5-14(13)19-10/h2-10H,1H3
charge 0 multiplicity 1
31 atoms
Cl 6.227176 0.384529 0.457516
O  -1.571515 -1.623595 0.815526
O  -0.281671 1.993328 -0.765661
N  0.201525 -0.229442 -0.127174
C  -0.36797 -1.602836 -0.046341
C  -2.125951 0.53507 -0.200111
C  -0.682091 0.842554 -0.417142
C  1.626196 -0.064394 -0.024937
C  -2.525453 -0.649848 0.472479
C  -0.700453 -2.201474 -1.423849
C  -3.111717 1.497296 -0.53458
C  -3.867093 -0.86522 0.847188
C  2.189874 1.163057 0.421307
C  2.497389 -1.144054 -0.334266
C  -4.460614 1.2826 -0.19433
C  -4.832189 0.105805 0.50717
C  3.584388 1.299453 0.564922
C  3.894818 -1.014747 -0.182394
C  4.422668 0.207786 0.266284
H  0.345668 -2.233019 0.505011
H  0.202132 -2.227851 -2.058811
H  -1.081364 -3.229499 -1.302279
H  -1.463909 -1.59996 -1.945294
H  -2.782264 2.412544 -1.036933
H  -4.134292 -1.782203 1.38028
H  1.542708 2.012571 0.64119
H  2.110443 -2.093349 -0.716073
H  -5.219155 2.026462 -0.457069
H  -5.879281 -0.057901 0.784309
H  4.008953 2.246032 0.91113
H  4.555844 -1.851995 -0.422969
