program: Gaussian 09
title: 000029207
version: EM64L-G09RevD.01
frameworkgroup: C1[X(C14H10N2O4)]
method: RPBEPBE
basis: SDD
operation: Freq
keyword: #p
keyword: freq=noraman
keyword: PBEPBE/SDD
title: #p freq=noraman PBEPBE/SDD
converged: YES YES NO NO
title: Mulliken charges:
elementType: O O O O N N C C C C C C C C C C C C C C H H H H H H H H H H
charge: -0.234923 -0.230327 -0.209479 -0.214225 -0.283966 0.021669 -0.327758 0.089114 0.500863 0.161576 0.224320 -0.300644 -0.353967 -0.327457 -0.347556 -0.372916 -0.377179 0.395758 -0.243711 -0.193200 0.243004 0.256699 0.289756 0.243078 0.274696 0.260931 0.288790 0.287759 0.239714 0.239580
chargesum: 0.00000
title: Mulliken charges with hydrogens summed into heavy atoms:
elementType: O O O O N N C C C C C C C C C C C C C C
charge: -0.234923 -0.230327 -0.209479 -0.214225 -0.283966 0.021669 0.171946 0.089114 0.500863 0.161576 0.224320 -0.010889 -0.110890 -0.052761 -0.086624 -0.084126 -0.089419 0.395758 -0.003997 0.046380
polarizability: 3.48259353e+02 -6.52766937e+00 1.66435723e+02 -2.89316478e+00 5.34752362e+00 9.01992720e+01
1716.lowfreq: -8.9939 -2.1087 -0.0005 -0.0004 0.0003 5.8602 27.2186 43.4345 57.2332
frequency: 27.1881 43.3938 57.2188 78.9893 116.9976 125.3390 157.4480 206.1882 215.8288 233.5353 278.4447 302.0014 347.4993 380.7544 412.0565 419.6655 426.8301 469.4521 496.1946 510.0422 521.4852 525.4671 553.0514 617.3816 628.4107 664.6969 671.5289 681.2961 714.4848 738.5139 762.7195 772.3159 782.7273 800.8219 825.5900 835.5426 855.5275 881.5951 952.1838 969.8589 974.6629 989.2139 996.7744 1000.2215 1016.2470 1032.8343 1067.1760 1093.4319 1099.5569 1122.9904 1142.4285 1165.5460 1187.9344 1206.9924 1221.4673 1225.9491 1262.0780 1285.8584 1307.6243 1323.3507 1361.2265 1390.8738 1396.2047 1404.4514 1432.2629 1447.1153 1461.5443 1472.9150 1490.4248 1575.3712 1589.8721 1601.3572 1611.6533 1623.7257 2973.7849 3136.4155 3142.5033 3152.5817 3155.6165 3169.8085 3179.5385 3180.9954 3185.2075 3209.6522
redmass: 7.3180 7.7964 7.6504 5.1459 4.9369 8.7941 6.1768 9.2690 3.9359 7.2638 5.8501 4.4143 4.5590 6.1348 2.9786 8.2803 3.8909 8.1843 4.2525 5.9432 3.7556 6.2465 5.3674 6.8971 7.1052 4.4398 5.8530 5.8041 5.6946 4.9993 2.5688 7.2502 1.7341 6.0214 1.2955 4.5614 1.8064 1.4571 9.4055 1.3745 1.3434 1.3563 1.3420 3.3101 3.1069 2.0630 2.5436 3.0780 2.9068 1.4386 1.7834 1.1791 1.6053 2.7190 1.9852 3.3163 1.4255 1.7861 1.3482 2.6852 7.3253 2.3869 5.6970 2.7945 3.9220 2.3522 1.9991 1.3525 2.3108 7.7907 7.7678 7.9298 7.2280 7.4222 1.0686 1.0975 1.0865 1.0900 1.0903 1.0954 1.1001 1.0908 1.0952 1.0955
irintensity: 0.0176 0.8305 1.4237 0.4931 1.0703 6.8199 3.7190 0.7786 7.3282 0.9204 4.1714 2.7137 11.2469 0.6047 2.0283 6.9636 1.0327 16.3958 9.4457 4.7630 2.1813 10.5587 2.3519 0.9127 4.1405 23.3351 7.2711 25.7604 22.3952 11.5955 43.8175 31.3951 50.9266 12.8714 6.5753 17.9274 44.2467 1.2754 17.2327 4.8479 5.2558 1.6922 1.1922 1.1126 134.1532 17.8436 16.6244 9.1454 44.9095 7.4651 32.1748 23.3911 280.1181 31.1046 44.2106 555.6150 103.9929 87.9563 6.1908 415.5728 101.1924 88.7288 29.2023 56.9830 31.5026 74.4665 12.0675 62.6926 75.5580 24.6495 5.6174 138.7861 290.2010 43.2018 51.2238 7.9945 3.5147 8.8687 4.8799 8.8172 17.1670 0.8920 3.4186 0.8847
temp: 298.150 k
press: 1.00000 atm
elementType: 8 8 8 8 7 7 6 6 6 6 6 6 6 6 6 6 6 6 6 6 1 1 1 1 1 1 1 1 1 1
symmnumber: 1
zpe: 568990.0 jmol-1
zpe.correction: 0.216717 hartree
zpe.thermalcorrener: 0.232328 hartree
zpe.thermalcorrenthalpy: 0.233272 hartree
zpe.thermalcorrgfe: 0.172427 hartree
zpe.sumelectzpe: -948.417222 hartree
zpe.sumelectthermal: -948.401611 hartree
zpe.sumelectthermalent: -948.400667 hartree
zpe.sumelectthermalfe: -948.461512 hartree
dipole: -7.5285 -2.8525 -0.7629
dipole: 8.0868
quadrupole: -135.3563 -112.0816 -115.4527
quadrupole: -2.9856 -2.3901 4.3629
quadrupole: -14.3927 8.8819 5.5108 -2.9856 -2.3901 4.3629
hfenergy: -948.6339392 hartree
pointgroup: C01 [X(C14H10N2O4)]
dipole: 2.9609422 -1.109281 0.3533266 debye
polarizability: 348.2479511|7.164896|166.3500909|0.5916354|-6.111727|90.2963052 unknown
InChI: InChI=1S/C14H10N2O4/c17-14-12-3-1-2-4-13(12)20-9-15(14)10-5-7-11(8-6-10)16(18)19/h1-8H,9H2
charge 0 multiplicity 1
30 atoms
O  2.229655 -1.806345 -0.543642
O  0.934445 1.960619 0.60102
O  -5.700526 1.169763 -0.822779
O  -5.941964 -0.870458 0.172008
N  0.461572 -0.330174 0.257599
N  -5.218297 0.108878 -0.26415
C  1.071742 -1.674641 0.347588
C  2.788956 0.439839 0.258149
C  -0.956393 -0.193304 0.152269
C  1.344927 0.780546 0.410326
C  3.191779 -0.806119 -0.293777
C  -1.537759 0.950735 -0.4667
C  -1.806672 -1.221554 0.650378
C  3.777455 1.425311 0.511355
C  4.534245 -1.063386 -0.63392
C  -2.930828 1.049933 -0.601768
C  -3.201569 -1.129349 0.511797
C  -3.752117 0.006863 -0.117168
C  5.127687 1.170646 0.209379
C  5.500542 -0.069059 -0.37404
H  1.411967 -1.877962 1.383723
H  0.357557 -2.435517 0.008459
H  -0.897842 1.75502 -0.830286
H  -1.390726 -2.082592 1.182368
H  3.450795 2.387957 0.917715
H  4.801767 -2.028039 -1.074286
H  -3.392421 1.916232 -1.082389
H  -3.866882 -1.90803 0.89313
H  5.888161 1.931621 0.409475
H  6.549943 -0.262635 -0.620832
