program: Gaussian 09
title: 000029236
version: EM64L-G09RevD.01
frameworkgroup: C1[X(C22H27NO3)]
method: RPBEPBE
basis: SDD
operation: Freq
keyword: #p
keyword: freq=noraman
keyword: PBEPBE/SDD
title: #p freq=noraman PBEPBE/SDD
converged: NO YES NO NO
title: Mulliken charges:
elementType: O O O N C C C C C C C C C C C C C C C C C C C C C C H H H H H H H H H H H H H H H H H H H H H H H H H H H
charge: -0.265010 -0.247369 -0.275149 -0.069508 0.119263 -0.472197 -0.458187 -0.435115 -0.415866 0.423157 0.179244 -0.364417 -0.367657 -0.405215 -0.312462 -0.261954 -0.248346 -0.241590 -0.225260 -0.675539 0.367676 -0.349458 -0.379340 -0.223555 -0.197358 -0.258030 0.223618 0.209319 0.226121 0.224716 0.214595 0.192977 0.216667 0.204065 0.203539 0.220577 0.255025 0.250836 0.221805 0.211775 0.226108 0.224251 0.229125 0.228785 0.229170 0.233235 0.227530 0.212960 0.249840 0.248175 0.222147 0.225754 0.226528
chargesum: 0.00000
title: Mulliken charges with hydrogens summed into heavy atoms:
elementType: O O O N C C C C C C C C C C C C C C C C C C C C C C
charge: -0.265010 -0.247369 -0.275149 -0.069508 0.119263 -0.039260 -0.007350 -0.027542 0.004866 0.423157 0.179244 0.059698 -0.112632 -0.154379 0.121118 -0.035846 -0.024094 -0.012465 0.232695 -0.001813 0.367676 -0.099618 -0.131164 -0.001409 0.028396 -0.031502
polarizability: 3.21487364e+02 2.03448006e+01 2.41270057e+02 8.37870417e+00 -2.71283290e+00 1.89609396e+02
1716.lowfreq: -4.9275 -0.0008 0.0006 0.0008 6.1927 9.0840 17.2801 20.9478 23.5900
frequency: 17.2007 20.8485 23.5240 29.3827 45.4218 64.9359 67.0764 72.0123 84.2394 116.4921 122.3002 136.6155 144.9374 146.6534 184.4637 202.8531 230.4136 240.6589 253.7021 261.8984 300.4265 307.1122 315.5034 338.7365 358.1685 372.4483 384.0691 403.5685 412.1435 445.9336 480.0893 495.2726 503.5424 520.3100 531.0355 557.6248 593.2780 610.5825 617.3143 638.9105 692.1029 697.7573 706.6510 747.1828 758.5698 767.7097 780.2136 799.3564 802.6511 812.7999 817.5953 821.4848 831.4960 854.2708 890.0465 893.8743 914.1831 935.1073 953.2686 961.2404 975.1885 978.9780 981.5449 986.6749 990.4136 995.8753 997.6462 1019.5915 1022.3450 1022.7175 1032.2115 1058.4927 1076.0053 1082.2076 1084.2411 1087.7148 1102.2821 1112.4066 1126.5781 1135.5545 1140.4480 1161.4892 1166.0939 1166.8996 1174.1044 1178.0771 1191.9445 1194.0449 1200.5539 1218.5081 1222.0470 1248.7160 1268.4881 1279.0746 1295.1936 1305.0223 1313.7052 1322.6372 1324.2992 1332.2526 1349.0607 1353.7890 1357.5572 1376.0176 1378.7557 1387.8303 1401.8253 1402.6071 1433.8466 1440.7357 1443.8162 1455.6104 1463.9458 1467.0189 1471.7911 1474.2434 1475.8877 1482.4283 1483.6747 1486.8195 1488.2430 1589.4300 1591.3792 1605.3199 1612.2566 1614.2099 2843.9732 2866.5392 2900.7278 2966.6996 2995.7507 3002.3218 3010.3568 3011.5386 3026.6399 3030.0784 3037.9031 3052.9974 3068.8575 3076.9273 3082.6869 3092.2282 3107.4480 3121.7351 3126.8566 3129.1906 3135.6593 3142.0325 3154.0847 3156.3308 3162.1810 3168.0255 3171.8264
redmass: 4.6538 4.1959 4.2391 4.1682 3.7023 4.5658 3.1828 3.9083 5.2248 4.0110 2.9263 2.9256 2.6580 3.7874 3.8328 2.8005 4.9008 2.4789 3.0845 1.8619 2.8223 4.7755 2.6209 3.7905 2.9630 3.5369 2.0565 2.8373 2.9327 3.3199 4.2125 3.5336 2.8566 4.5498 3.7397 3.3429 3.7183 6.4073 6.2306 4.3501 2.0406 6.0945 1.7273 3.7911 1.6545 2.6626 3.3631 1.1049 2.7790 2.0133 1.3177 2.5271 1.2416 1.2517 1.4628 3.6726 1.8734 2.2265 2.2075 1.3666 6.0410 1.3928 1.2972 6.6211 5.7363 1.4560 2.1782 1.6775 2.2908 2.0421 2.3022 2.4975 1.8765 1.5510 1.9252 2.5947 2.8796 2.2414 2.9141 1.4704 2.4750 2.1423 1.6601 1.1920 1.0587 1.1690 1.4382 1.9976 1.1927 2.2105 2.4888 1.1352 1.3024 1.3969 1.3070 1.3895 1.3344 1.3345 1.3418 1.4090 1.3811 1.3617 1.4033 1.5567 5.9591 3.8936 1.2651 1.5636 2.0908 1.1320 2.3728 1.0987 1.0403 1.1144 1.2123 1.0623 1.3272 1.2096 2.0954 1.0680 1.2261 5.9673 6.4640 7.6331 6.2633 7.6864 1.0708 1.0708 1.0693 1.0561 1.0359 1.0623 1.0582 1.0628 1.0977 1.0877 1.0870 1.0985 1.1066 1.1011 1.1018 1.0985 1.1026 1.0848 1.0847 1.0881 1.0889 1.0935 1.0924 1.0960 1.0956 1.0986 1.1007
irintensity: 0.2799 0.0660 0.3600 0.5088 0.0886 0.3157 0.8022 0.4324 0.3559 3.3797 0.3128 1.1760 1.9823 1.8347 3.1496 2.0191 0.4097 2.5403 4.1791 1.2514 1.9615 2.0667 1.8535 5.8011 17.8904 0.1521 2.3506 0.0605 0.0323 1.3678 0.3148 0.5790 11.7307 6.9339 23.2973 1.2374 4.8213 1.0621 0.2426 6.1055 33.7666 3.1198 50.5165 28.9505 88.5776 4.5787 17.0007 3.9047 9.9545 4.7336 0.2746 3.6751 0.4758 0.2230 7.6589 16.1909 2.9491 4.9210 1.7404 0.2770 57.4662 0.0943 0.5473 41.3808 0.6999 13.1627 38.4420 5.8881 64.7607 25.4280 5.1633 36.7072 12.6858 9.0011 53.1937 21.2173 166.3726 6.4771 77.1681 6.8399 66.9497 50.9988 14.5220 17.2938 0.2687 41.9671 7.6847 7.6879 2.4421 120.6754 144.1877 0.0711 5.2035 27.4951 19.7701 5.1641 0.4633 7.0763 9.6225 2.9450 5.4715 1.3626 1.1175 9.1328 0.4523 4.3354 24.6424 7.5596 13.5880 5.2369 2.3097 19.7195 11.2070 15.0203 44.1449 3.3914 95.5830 17.9137 23.7338 12.1979 6.7205 3.4326 25.6291 85.6912 93.8057 57.9217 82.7219 65.8305 80.2918 38.5957 20.5066 15.3427 19.9854 20.0617 18.4406 30.7281 42.1458 60.9833 7.2920 18.7551 17.7220 29.8528 41.2648 1.7757 3.4189 3.4038 11.9171 21.8100 35.4556 36.2768 22.9436 14.5478 7.7101
temp: 298.150 k
press: 1.00000 atm
elementType: 8 8 8 7 6 6 6 6 6 6 6 6 6 6 6 6 6 6 6 6 6 6 6 6 6 6 1 1 1 1 1 1 1 1 1 1 1 1 1 1 1 1 1 1 1 1 1 1 1 1 1 1 1
symmnumber: 1
zpe: 1162717.7 jmol-1
zpe.correction: 0.442856 hartree
zpe.thermalcorrener: 0.467717 hartree
zpe.thermalcorrenthalpy: 0.468662 hartree
zpe.thermalcorrgfe: 0.384845 hartree
zpe.sumelectzpe: -1133.011398 hartree
zpe.sumelectthermal: -1132.986536 hartree
zpe.sumelectthermalent: -1132.985592 hartree
zpe.sumelectthermalfe: -1133.069408 hartree
dipole: -2.2623 0.3161 -1.3352
dipole: 2.6459
quadrupole: -147.6403 -141.9921 -157.7649
quadrupole: -5.4254 4.3941 -2.4698
quadrupole: 1.4922 7.1403 -8.6325 -5.4254 4.3941 -2.4698
hfenergy: -1133.4542533 hartree
pointgroup: C01 [X(C22H27N1O3)]
dipole: -0.8973093 -0.0914573 0.5196866 debye
polarizability: 321.6777212|-20.7098755|240.7054541|-5.2553762|-6.2266769|189.9836424 unknown
InChI: InChI=1S/C22H27NO3/c1-2-25-21(24)22(19-9-5-3-6-10-19)13-15-23(16-14-22)17-18-26-20-11-7-4-8-12-20/h3-12H,2,13-18H2,1H3
charge 0 multiplicity 1
53 atoms
O  -3.478002 -1.943909 0.175855
O  -2.798633 -1.358159 -1.964729
O  4.271763 -0.875331 0.307286
N  0.581273 -0.340342 0.45753
C  -2.312015 0.186012 -0.06621
C  -1.73323 -0.113019 1.344001
C  -1.16307 0.775528 -0.943281
C  -0.471454 -0.993662 1.273983
C  0.097888 -0.109454 -0.928855
C  -3.511052 1.171864 -0.038384
C  -2.850322 -1.100717 -0.737911
C  1.880124 -1.051466 0.502487
C  -4.130937 1.544576 -1.262126
C  -4.009798 1.728752 1.165382
C  3.04097 -0.066603 0.304005
C  -5.207876 2.455288 -1.281956
C  -5.087045 2.644635 1.146735
C  -5.690212 3.014351 -0.075493
C  -4.136942 -3.160882 -0.3943
C  -4.719516 -3.936408 0.782294
C  5.496313 -0.207206 0.145492
C  5.627184 1.194741 -0.019962
C  6.646527 -1.03633 0.155589
C  6.917182 1.754747 -0.175601
C  7.923244 -0.462472 -0.000198
C  8.068389 0.937505 -0.167343
H  -2.490365 -0.606432 1.977251
H  -1.449456 0.847846 1.813418
H  -0.914844 1.776184 -0.543911
H  -1.505083 0.893765 -1.985606
H  -0.077499 -1.145158 2.295769
H  -0.741999 -2.004602 0.870927
H  -0.122087 -1.078043 -1.44548
H  0.893424 0.392115 -1.509136
H  1.9554 -1.863049 -0.26026
H  1.996484 -1.527044 1.493171
H  -3.778093 1.107439 -2.203697
H  -3.566381 1.453855 2.126532
H  3.058627 0.67149 1.129451
H  2.951751 0.475453 -0.659313
H  -5.671584 2.72663 -2.237106
H  -5.454825 3.066544 2.089145
H  -6.525461 3.723441 -0.088571
H  -3.377771 -3.737671 -0.952891
H  -4.910485 -2.827456 -1.109587
H  -5.456376 -3.325124 1.330584
H  -3.926073 -4.241065 1.48614
H  -5.22703 -4.847135 0.415259
H  4.749733 1.848041 -0.027706
H  6.514373 -2.115125 0.284934
H  7.016118 2.83888 -0.303225
H  8.808113 -1.10889 0.008263
H  9.062436 1.380472 -0.288645
