program: Gaussian 09
title: 000029224
version: EM64L-G09RevD.01
frameworkgroup: C1[X(C18H28N2)]
method: RPBEPBE
basis: SDD
operation: Freq
keyword: #pfreq=noraman
keyword: PBEPBE/SDD
title: #p freq=noraman PBEPBE/SDD
converged: NO YES NO NO
title: Mulliken charges:
elementType: N N C C C C C C C C C C C C C C C C C C H H H H H H H H H H H H H H H H H H H H H H H H H H H H
charge: -0.181652 -0.073487 -0.093566 -0.100895 -0.447193 -0.430093 -0.628037 -0.418536 -0.383876 0.377226 0.205548 -0.443404 -0.390584 -0.426617 -0.365993 -0.341697 -0.279531 -0.259037 -0.615600 -0.627497 0.229507 0.206473 0.197182 0.200326 0.198385 0.225372 0.223904 0.225284 0.187564 0.203488 0.209210 0.201611 0.209347 0.216326 0.245602 0.209124 0.222617 0.226803 0.208484 0.168553 0.220996 0.216852 0.225611 0.184607 0.222268 0.220144 0.181821 0.237063
chargesum: 0.00000
title: Mulliken charges with hydrogens summed into heavy atoms:
elementType: N N C C C C C C C C C C C C C C C C C C
charge: -0.181652 -0.073487 0.135941 0.105578 -0.049684 -0.006335 -0.178850 -0.007715 0.007175 0.377226 0.205548 -0.017731 0.064141 -0.204000 -0.139190 0.035339 -0.058535 -0.042185 0.016886 0.011530
polarizability: 2.27278548e+02 -9.26518655e-01 2.37951139e+02 -1.65222689e+01 1.80905889e+00 1.51433794e+02
1716.lowfreq: -11.1503 -3.4865 -0.0002 0.0006 0.0007 10.1481 23.2268 31.5423 36.1593
frequency: 21.8698 31.1260 36.0002 47.6745 93.2638 106.0000 125.4246 139.2194 156.2759 179.3552 207.4433 233.1483 243.7706 255.5022 278.2837 304.6183 312.5745 328.1783 334.9978 351.4848 377.9335 412.6765 441.4169 450.4832 453.5604 476.8591 492.7189 534.0855 542.7880 579.5129 616.1654 636.4200 714.2454 722.7941 744.0077 763.4835 779.8777 806.5736 814.7850 826.8805 836.7215 845.9449 863.3031 886.1796 902.2782 918.5519 934.8143 959.4065 979.5827 991.5972 1008.8452 1031.5660 1034.3878 1035.9039 1048.5341 1053.8642 1066.3187 1070.9993 1086.9625 1093.7046 1095.7407 1110.4838 1121.0198 1131.5497 1143.0691 1158.8325 1172.7650 1183.5781 1202.6972 1207.4931 1216.1474 1226.2202 1242.5171 1251.9903 1259.3655 1261.0087 1279.1059 1283.8162 1294.4218 1297.1264 1309.9908 1312.2968 1329.0010 1336.7093 1338.5771 1341.4764 1357.5296 1363.9683 1365.5498 1375.4241 1382.8540 1401.8795 1419.1485 1442.5419 1451.0843 1459.5160 1460.1584 1462.4136 1463.8221 1469.0908 1474.3523 1474.6546 1477.4397 1479.5313 1484.6913 1486.3176 1495.7328 1507.0835 1578.3592 1616.8626 2800.9557 2836.3396 2853.8945 2938.9831 2959.0823 2961.1168 2965.2436 2966.5585 2978.7204 2983.1605 2986.9656 2989.0805 3000.7897 3017.1951 3018.0465 3019.1736 3024.1543 3028.3642 3030.7984 3035.5456 3045.9600 3065.7767 3076.5421 3088.6073 3106.5492 3123.3007 3151.5777 3164.6767
redmass: 3.9412 2.5654 4.1026 3.4422 2.7601 2.7346 3.4174 2.4573 2.6292 3.1111 2.6738 1.1562 1.1440 3.0439 2.6242 2.6467 2.7250 2.6098 2.3260 2.1346 3.9392 2.4775 2.4187 2.7047 3.1074 3.0139 2.9489 3.2456 4.5552 3.2401 2.6007 4.1671 2.3718 3.2901 1.5491 1.1556 2.0506 3.1900 1.8372 1.7138 2.6521 2.1362 1.5455 2.2380 1.9029 1.4563 1.5933 1.3073 2.0000 2.2772 3.0181 2.0073 3.0731 2.3571 1.9599 1.8453 1.6409 2.1619 2.0701 1.3784 1.3939 1.7316 1.6607 1.7772 1.5638 1.6274 1.1690 1.5767 1.9425 1.7853 1.9186 1.6204 1.3226 1.3647 1.9277 1.4867 1.5310 1.4939 1.2048 1.4593 1.3710 1.3320 1.4278 1.4630 1.5248 1.4338 1.4140 1.4866 1.4230 1.3993 6.2417 1.6914 1.1445 1.1676 2.4119 1.1066 1.0767 1.0592 1.0904 1.0871 1.0659 1.0965 1.0736 1.0832 1.1052 1.0670 1.2589 2.1290 6.7319 6.5027 1.0702 1.0578 1.0576 1.0829 1.0643 1.0639 1.0619 1.0623 1.0631 1.0619 1.0811 1.0777 1.0689 1.0716 1.0990 1.0988 1.0974 1.0951 1.0712 1.1029 1.1024 1.1029 1.1011 1.1003 1.0879 1.0875 1.0930 1.0981
irintensity: 0.0925 0.3743 0.1616 0.0736 0.8019 0.2633 0.1439 0.3897 0.0164 0.0948 0.1142 1.1937 0.3771 3.1405 1.7597 5.5777 1.2790 1.7460 3.6463 0.1015 4.7013 1.4804 2.1480 1.4832 3.3847 9.2309 3.5450 0.5618 1.0200 2.4627 2.3947 2.1748 9.0165 4.5153 84.1699 6.0206 0.3793 11.1581 21.4707 0.4205 0.2698 4.2399 4.2672 8.9496 1.2930 3.5923 0.9842 0.0119 3.9632 2.0889 11.0779 7.8611 1.2687 26.7253 12.2654 8.9099 2.9137 22.3062 17.9734 6.4361 11.9401 3.1347 4.8125 0.7905 7.5837 11.1998 1.0858 2.9029 35.8447 25.7140 4.0990 24.3928 10.4629 10.8729 2.8180 4.4489 23.9603 48.1628 6.5010 4.3956 4.7676 10.6537 4.5240 2.8093 12.3311 1.6217 38.2887 16.9629 2.2380 15.3375 15.3985 2.4129 2.0967 2.3708 25.6270 2.6472 11.2939 18.0498 7.2964 11.7502 9.2939 8.5812 5.1008 8.2351 26.7662 8.1065 29.8250 158.1646 11.5572 108.0116 80.4401 72.3878 233.5382 28.9618 16.3166 41.9614 46.7228 23.1360 48.9874 35.4939 34.6866 3.5255 51.0885 48.9362 14.8725 23.3245 87.4503 38.7513 43.9834 21.7121 95.5587 41.0909 37.4517 45.1132 16.9651 12.7473 43.4449 23.2659
temp: 298.150 k
press: 1.00000 atm
elementType: 7 7 6 6 6 6 6 6 6 6 6 6 6 6 6 6 6 6 6 6 1 1 1 1 1 1 1 1 1 1 1 1 1 1 1 1 1 1 1 1 1 1 1 1 1 1 1 1
symmnumber: 1
zpe: 1117893.0 jmol-1
zpe.correction: 0.425783 hartree
zpe.thermalcorrener: 0.445387 hartree
zpe.thermalcorrenthalpy: 0.446331 hartree
zpe.thermalcorrgfe: 0.376782 hartree
zpe.sumelectzpe: -810.655031 hartree
zpe.sumelectthermal: -810.635427 hartree
zpe.sumelectthermalent: -810.634483 hartree
zpe.sumelectthermalfe: -810.704031 hartree
dipole: 0.5644 -3.4088 -0.3280
dipole: 3.4708
quadrupole: -114.4898 -124.1757 -124.0430
quadrupole: -0.2680 -4.5122 -1.1110
quadrupole: 6.4130 -3.2729 -3.1402 -0.2680 -4.5122 -1.1110
hfenergy: -811.0808136 hartree
pointgroup: C01 [X(C18H28N2)]
dipole: 0.2868076 -1.3235978 -0.1744221 debye
polarizability: 227.4783668|-0.8680698|237.6626168|-16.4326433|4.0090729|151.5224977 unknown
InChI: InChI=1S/C18H28N2/c1-19(2)12-7-13-20-17-10-5-3-8-15(17)14-16-9-4-6-11-18(16)20/h3,5,8,10,16,18H,4,6-7,9,11-14H2,1-2H3
charge 0 multiplicity 1
48 atoms
N  -0.144172 -0.094946 -0.434385
N  4.845111 -0.173667 0.393114
C  -1.954546 -1.097807 0.975812
C  -0.935397 -1.321811 -0.172483
C  -2.774153 -2.389406 1.233985
C  -1.621531 -1.864664 -1.45846
C  -2.838712 0.131436 0.662576
C  -3.440782 -2.957012 -0.04318
C  -2.398058 -3.170848 -1.165827
C  -1.990559 1.352536 0.338877
C  -0.665549 1.188544 -0.193829
C  1.209216 -0.285384 -0.97902
C  2.333859 -0.19229 0.08547
C  -2.493269 2.651244 0.562029
C  0.099187 2.365399 -0.469199
C  3.722549 -0.433839 -0.539607
C  -1.740213 3.810866 0.268653
C  -0.435479 3.650407 -0.248699
C  6.144021 -0.14667 -0.31056
C  4.870672 -1.094327 1.547346
H  -1.3732 -0.862461 1.890817
H  -0.219683 -2.100043 0.172615
H  -3.541287 -2.186336 2.007572
H  -2.09906 -3.164037 1.653943
H  -0.854434 -2.039099 -2.238461
H  -2.308621 -1.095112 -1.859855
H  -3.492806 0.348615 1.528668
H  -3.516678 -0.098579 -0.184276
H  -1.682949 -3.960958 -0.853068
H  -2.891327 -3.534795 -2.087565
H  -4.227906 -2.264704 -0.402475
H  -3.947641 -3.91212 0.195304
H  1.245985 -1.286183 -1.451849
H  1.401038 0.444106 -1.791743
H  2.32538 0.804278 0.563224
H  2.122793 -0.935701 0.877889
H  -3.504573 2.751151 0.978299
H  1.119729 2.284263 -0.853578
H  3.846787 0.252989 -1.401165
H  3.765841 -1.479497 -0.95338
H  -2.155292 4.807885 0.448337
H  0.17971 4.529268 -0.475596
H  6.117358 0.612898 -1.112352
H  6.422007 -1.129067 -0.773436
H  6.944669 0.132934 0.397568
H  5.722256 -0.836224 2.201727
H  4.976591 -2.17038 1.249205
H  3.948019 -0.991154 2.142321
