program: Gaussian 09
title: 000029211
version: EM64L-G09RevD.01
frameworkgroup: C1[X(C10H14Br2N2O3)]
method: RPBEPBE
basis: SDD
operation: Freq
keyword: #p
keyword: freq=noraman
keyword: PBEPBE/SDD
title: #p freq=noraman PBEPBE/SDD
converged: YES YES NO NO
title: Mulliken charges:
elementType: Br Br O O O N N C C C C C C C C C C H H H H H H H H H H H H H H
charge: -0.024187 -0.027047 -0.223154 -0.195427 -0.207491 -0.385209 -0.373864 0.095929 -0.409334 -0.396504 0.185425 0.143787 -0.461944 -0.505704 -0.656089 -0.649710 0.153928 0.290779 0.248104 0.256139 0.268932 0.317796 0.329664 0.371050 0.373314 0.229991 0.275598 0.249976 0.260564 0.211857 0.252830
chargesum: 0.00000
title: Mulliken charges with hydrogens summed into heavy atoms:
elementType: Br Br O O O N N C C C C C C C C C C
charge: -0.024187 -0.027047 -0.223154 -0.195427 -0.207491 -0.014159 -0.000550 0.095929 0.129549 0.128567 0.185425 0.143787 -0.144148 -0.176039 0.099476 0.075541 0.153928
polarizability: 1.64248993e+02 4.28332994e+00 1.94119974e+02 -5.31566313e+00 3.16057731e+00 1.35884192e+02
1716.lowfreq: -9.9498 -9.1173 -0.0004 0.0004 0.0005 6.0113 9.6191 32.1204 43.1965
frequency: 1.2967 32.0787 43.1563 44.6603 81.1361 103.4437 133.9274 141.3063 149.8061 157.2409 165.5868 204.9671 244.0160 252.6573 263.1720 289.1909 299.1779 314.7687 336.8138 359.1944 394.7293 403.5121 439.1929 463.6447 483.5747 567.8839 597.3711 607.2843 630.8513 654.2588 683.1762 713.2515 750.8922 757.6323 787.8533 820.8635 852.2236 888.8274 904.7349 945.5250 982.7731 991.2416 1004.7666 1015.8272 1059.0172 1099.9954 1126.0522 1139.7959 1151.5403 1187.7210 1191.0655 1212.5658 1261.7019 1280.1545 1300.6078 1332.3482 1341.6722 1351.9952 1356.0978 1364.6348 1377.8769 1379.9603 1398.0804 1400.8343 1449.6586 1455.7235 1461.5055 1470.3201 1475.3958 1479.7389 1613.9189 1650.5737 1681.2140 2967.7528 2991.9049 2999.7343 3024.1221 3066.0571 3067.9021 3080.0170 3081.9825 3092.5378 3097.0262 3107.2863 3118.4672 3515.2518 3516.9972
redmass: 5.3848 9.6174 6.8489 4.9516 4.9372 7.6396 7.7608 7.3531 10.5574 4.8890 10.0982 2.8637 2.1644 1.5168 2.0233 3.0610 1.6813 2.1579 6.4865 11.2145 4.6060 2.1643 2.7211 5.3171 8.8241 5.2249 3.7604 5.9952 4.4597 2.5847 2.6166 5.6563 3.3500 2.0884 1.6773 2.1411 2.3184 2.4873 1.6560 3.7244 1.8929 3.0752 1.4905 1.5438 2.2868 2.2231 2.5253 2.3889 2.7233 1.3350 2.7056 1.5096 1.2574 1.3530 3.2631 1.3079 1.3797 3.3039 1.3833 1.6808 1.5010 1.9705 1.2163 1.2135 1.0823 1.0829 1.0510 1.0571 1.0494 1.0457 6.7903 8.3654 5.6686 1.0445 1.0361 1.0594 1.0595 1.0988 1.0875 1.0959 1.0938 1.0962 1.0991 1.0987 1.1001 1.0758 1.0783
irintensity: 0.8369 0.4927 0.2419 0.6125 0.0562 0.2979 1.9601 0.1683 0.4444 0.3286 15.6536 0.2449 1.2367 1.3863 8.0392 4.4779 1.3497 5.9937 12.8529 24.5934 7.0952 0.1132 6.1902 47.2897 15.8561 7.9140 26.1703 8.1830 7.6933 10.9206 23.1021 8.0934 5.2275 3.6755 205.7805 6.3702 13.6810 10.9483 2.2625 16.0985 1.1793 4.2943 32.8786 36.4233 9.0197 10.2201 7.9501 40.7485 21.2835 32.6589 26.4984 39.2787 5.8398 33.4040 232.9944 42.4161 64.3749 158.4355 15.8294 60.3279 3.8978 10.0619 23.6722 33.7412 13.9535 5.5583 10.2683 8.0065 23.0797 23.6706 275.7883 95.9644 622.4556 30.4303 11.0176 6.3998 10.0962 2.8613 21.0872 1.6275 2.2145 8.4901 2.9290 20.7805 11.6398 96.7031 55.9378
temp: 298.150 k
press: 1.00000 atm
elementType: 35 35 8 8 8 7 7 6 6 6 6 6 6 6 6 6 6 1 1 1 1 1 1 1 1 1 1 1 1 1 1
symmnumber: 1
zpe: 620492.8 jmol-1
zpe.correction: 0.236333 hartree
zpe.thermalcorrener: 0.254794 hartree
zpe.thermalcorrenthalpy: 0.255738 hartree
zpe.thermalcorrgfe: 0.184076 hartree
zpe.sumelectzpe: -750.311554 hartree
zpe.sumelectthermal: -750.293093 hartree
zpe.sumelectthermalent: -750.292149 hartree
zpe.sumelectthermalfe: -750.363811 hartree
dipole: 0.3766 2.5376 1.1345
dipole: 2.8050
quadrupole: -130.6045 -132.4496 -125.0787
quadrupole: -4.4531 2.1019 -1.8029
quadrupole: -1.2269 -3.0720 4.2989 -4.4531 2.1019 -1.8029
hfenergy: -750.547887 hartree
pointgroup: C01 [X(C10H14Br2N2O3)]
dipole: -0.9038253 -0.3215093 -0.545535 debye
polarizability: 191.0078259|9.0102819|161.6486454|10.8576291|-9.3795484|141.5966881 unknown
InChI: InChI=1S/C10H14Br2N2O3/c1-5(11)3-10(4-6(2)12)7(15)13-9(17)14-8(10)16/h5-6,13-14H,3-4H2,1-2H3
charge 0 multiplicity 1
31 atoms
Br 2.740192 -3.245696 1.605419
Br 2.692378 3.592181 -0.327989
O  0.216846 -0.311923 -2.328318
O  -0.52532 1.12201 2.203425
O  -3.927814 -0.816549 -0.302134
N  -1.796599 -0.651077 -1.252548
N  -2.178759 0.095599 0.955531
C  0.189582 0.018117 0.119762
C  0.739299 -1.337862 0.778266
C  1.361563 1.042447 -0.01722
C  -0.433066 -0.29782 -1.251819
C  -0.845024 0.491078 1.16467
C  2.007328 -1.962816 0.15577
C  0.942164 2.520516 -0.158412
C  1.83793 -2.771723 -1.13036
C  0.048794 2.873114 -1.350437
C  -2.720889 -0.493916 -0.202126
H  0.964523 -1.06867 1.825903
H  -0.067203 -2.095833 0.794698
H  2.002676 0.954411 0.876836
H  1.956028 0.75192 -0.901052
H  2.824068 -1.229003 0.07476
H  0.532543 2.904527 0.788449
H  -2.189874 -0.980002 -2.141058
H  -2.847456 0.296594 1.70711
H  1.056331 -3.543565 -1.016572
H  1.559935 -2.101311 -1.963178
H  2.781475 -3.274775 -1.398367
H  0.485378 2.529123 -2.302514
H  -0.947261 2.397571 -1.235355
H  -0.114968 3.961933 -1.404839
