program: Gaussian 09
title: 000029161
version: EM64L-G09RevD.01
frameworkgroup: C1[X(C9H20O)]
method: RPBEPBE
basis: SDD
operation: Freq
keyword: #pfreq=noraman
keyword: PBEPBE/SDD
title: #p freq=noraman PBEPBE/SDD
converged: NO YES NO NO
title: Mulliken charges:
elementType: O C C C C C C C C C H H H H H H H H H H H H H H H H H H H H
charge: -0.270725 -0.387409 -0.342880 -0.255483 -0.350969 -0.371571 -0.240214 -0.345869 -0.693579 -0.686919 0.206469 0.206382 0.183424 0.183217 0.178318 0.178292 0.196573 0.196575 0.205166 0.205061 0.175739 0.175666 0.191134 0.191300 0.209119 0.209108 0.216485 0.211503 0.211471 0.214617
chargesum: 0.00000
title: Mulliken charges with hydrogens summed into heavy atoms:
elementType: O C C C C C C C C C
charge: -0.270725 0.025442 0.023761 0.101127 0.042179 0.038656 0.111191 0.036564 -0.058867 -0.049328
polarizability: 1.37225774e+02 5.53972177e-01 9.01604440e+01 1.56220803e-03 -2.39007329e-03 8.54467809e+01
1716.lowfreq: -0.0008 0.0005 0.0008 7.6848 8.5613 31.2281 40.1885 53.3413 59.1852
frequency: 31.4524 53.3349 59.0040 76.3001 99.0114 120.5545 131.7414 134.6764 150.2466 224.9033 230.2861 234.8385 238.6272 352.6564 388.0991 475.2141 502.8199 730.6932 742.5797 769.0351 808.4742 851.9863 876.8756 897.9545 936.2003 937.1193 968.4731 1010.1903 1027.9598 1061.3073 1072.9408 1079.6893 1084.4320 1114.5122 1135.8451 1139.2075 1161.6656 1201.3350 1212.2932 1248.8607 1259.1836 1270.7406 1271.4979 1278.5323 1282.8977 1292.4847 1317.0691 1342.5454 1355.5070 1361.9087 1388.5126 1392.0144 1410.8181 1466.9050 1467.8646 1470.6583 1473.3102 1476.5293 1477.4132 1477.8723 1482.1009 1487.2684 1490.1363 1496.5743 2890.1042 2901.9486 2938.7381 2939.9226 2951.9518 2963.5947 2967.9763 2969.7785 2973.4033 2988.0315 2989.7758 2991.9979 3006.3844 3021.6875 3051.8534 3052.7667 3066.8548 3069.5053 3071.7470 3072.0892
redmass: 3.6517 3.6809 1.5076 3.0931 1.7086 2.5599 3.2380 1.9114 2.5965 3.9263 1.1115 1.1198 3.2235 2.8566 3.5879 3.2526 3.3172 1.0696 1.0736 1.1089 1.1302 1.1669 2.5579 1.8146 3.0856 1.1454 1.1430 3.8095 3.8089 3.6803 2.5904 3.0660 2.2858 2.3691 2.7919 1.3790 1.5942 1.4550 1.3641 1.2836 1.2174 1.3048 1.1544 1.0945 1.0878 1.0914 1.3322 1.4026 1.5568 1.5656 1.2176 1.2176 1.4904 1.0742 1.0725 1.0720 1.0690 1.0426 1.0665 1.0419 1.0713 1.0798 1.0905 1.0855 1.0546 1.0544 1.1045 1.1062 1.0588 1.0587 1.0563 1.0391 1.0364 1.0592 1.0593 1.0990 1.1004 1.1030 1.1039 1.1040 1.1010 1.0992 1.1010 1.0995
irintensity: 0.3587 0.1257 0.2770 0.6279 2.5539 0.8212 0.5099 1.0746 3.7309 0.2042 0.0084 0.0652 0.2758 1.4107 0.3107 4.8653 4.9305 10.4867 9.0744 0.0372 0.3380 1.0612 2.4348 18.4754 9.3070 0.9240 0.6758 6.6166 12.8512 46.0330 59.4045 68.1581 6.6617 9.4437 0.5249 0.2369 4.5251 1.2913 0.6009 3.3101 0.0222 0.1643 0.0251 0.2683 0.0344 0.5413 2.2449 8.7310 12.7575 26.1774 14.3427 7.0064 0.5174 0.6660 0.1062 1.4741 1.5558 12.5517 7.6128 12.5054 2.6368 21.9883 0.6723 11.6561 24.5614 110.5158 111.2501 1.8228 18.3997 37.9218 61.1158 28.6620 31.9890 30.5277 60.1918 2.7187 7.6005 12.9189 6.1154 65.1821 110.4836 53.9937 102.9207 54.6504
temp: 298.150 k
press: 1.00000 atm
elementType: 8 6 6 6 6 6 6 6 6 6 1 1 1 1 1 1 1 1 1 1 1 1 1 1 1 1 1 1 1 1
symmnumber: 1
zpe: 717423.6 jmol-1
zpe.correction: 0.273252 hartree
zpe.thermalcorrener: 0.287178 hartree
zpe.thermalcorrenthalpy: 0.288122 hartree
zpe.thermalcorrgfe: 0.231362 hartree
zpe.sumelectzpe: -429.301807 hartree
zpe.sumelectthermal: -429.287881 hartree
zpe.sumelectthermalent: -429.286937 hartree
zpe.sumelectthermalfe: -429.343697 hartree
dipole: 0.0252 1.4094 0.0018
dipole: 1.4096
quadrupole: -62.3536 -65.9065 -64.3682
quadrupole: -1.5443 -0.0015 -0.0029
quadrupole: 1.8559 -1.6971 -0.1588 -1.5443 -0.0015 -0.0029
hfenergy: -429.575059 hartree
pointgroup: C01 [X(C9H20O1)]
dipole: -0.0083727 0.554524 0.0025266 debye
polarizability: 137.2223613|-0.6836844|90.1636663|-0.0097426|0.0300534|85.4469716 unknown
InChI: InChI=1S/C9H20O/c1-3-5-7-9-10-8-6-4-2/h3-9H2,1-2H3
charge 0 multiplicity 1
30 atoms
O  0.638382 -0.218076 0.006325
C  -1.781607 -0.380543 0.003362
C  -3.1394 0.358428 0.006912
C  -0.589418 0.581714 0.011122
C  -4.347926 -0.605614 0.004173
C  3.061321 -0.333529 0.002324
C  1.850512 0.60538 0.011216
C  4.404629 0.43253 0.006692
C  -5.704641 0.131215 0.008511
C  5.624789 -0.513632 0.003795
H  -1.705882 -1.0309 -0.889881
H  -1.707684 -1.043295 0.887602
H  -3.204223 1.02438 -0.879587
H  -3.203248 1.018574 0.897815
H  -0.616985 1.233897 0.915817
H  -0.615519 1.246732 -0.884222
H  -4.285402 -1.264413 -0.885989
H  -4.283705 -1.271771 0.88872
H  2.99988 -0.984457 -0.891552
H  3.001952 -0.998702 0.88579
H  1.865771 1.257375 0.916358
H  1.863366 1.271519 -0.883615
H  4.450922 1.092535 0.897469
H  4.452517 1.099482 -0.878808
H  -5.804867 0.772331 0.905031
H  -5.805751 0.781344 -0.881404
H  -6.551123 -0.580212 0.005246
H  5.618724 -1.169054 0.895135
H  5.617296 -1.165004 -0.89051
H  6.575118 0.051467 0.004253
