program: Gaussian 09
title: 000029226
version: EM64L-G09RevD.01
frameworkgroup: C1[X(C17H26N2)]
method: RPBEPBE
basis: SDD
operation: Freq
keyword: #pfreq=noraman
keyword: PBEPBE/SDD
title: #p freq=noraman PBEPBE/SDD
converged: YES YES NO NO
title: Mulliken charges:
elementType: N N C C C C C C C C C C C C C C C C C H H H H H H H H H H H H H H H H H H H H H H H H H H
charge: -0.185005 -0.319801 -0.092837 -0.113978 -0.443158 -0.440131 -0.623196 -0.418768 -0.385529 0.376152 0.190443 -0.403017 -0.420203 -0.422095 -0.369391 -0.281213 -0.259011 -0.367039 -0.618277 0.218614 0.257798 0.194019 0.197463 0.201225 0.222284 0.221845 0.225286 0.206858 0.199591 0.191053 0.200854 0.228205 0.210394 0.190816 0.232955 0.222046 0.226342 0.224243 0.195670 0.220102 0.215541 0.253612 0.195470 0.221250 0.222521
chargesum: 0.00000
title: Mulliken charges with hydrogens summed into heavy atoms:
elementType: N N C C C C C C C C C C C C C C C C C
charge: -0.185005 -0.066189 0.125777 0.143820 -0.051675 -0.016623 -0.176065 -0.012320 0.006378 0.376152 0.190443 0.035581 0.003568 -0.200049 -0.143048 -0.061111 -0.043469 0.052873 0.020964
polarizability: 2.36145652e+02 1.36515642e+01 1.97074613e+02 1.23101996e+01 -1.55728307e+01 1.46731539e+02
1716.lowfreq: -15.4744 -10.9179 -0.0003 0.0006 0.0008 14.6474 24.3047 33.2874 49.3496
frequency: 23.6085 30.5276 49.3160 72.9279 89.2931 112.4092 136.6350 159.3861 167.0116 202.2430 242.8656 249.5932 251.0696 279.4072 309.3699 329.5397 343.5937 354.4238 395.6025 429.9325 445.5090 453.2023 477.8023 499.5076 531.4708 534.1156 583.1143 606.9819 630.3027 678.0397 716.7033 720.1400 744.8305 772.6562 794.5756 815.2436 825.4056 833.5977 847.6613 855.9997 879.6919 900.3738 915.5919 920.5090 934.5041 958.7045 975.4096 988.4097 1001.4238 1033.8264 1037.2547 1049.2317 1053.1709 1066.6439 1073.3564 1093.2456 1106.8422 1109.4463 1123.0359 1132.2419 1141.5888 1154.8918 1168.3117 1174.8814 1188.3851 1206.0343 1215.8878 1233.0926 1241.6364 1245.6505 1252.2059 1258.7553 1283.5439 1293.1442 1306.2680 1311.6375 1333.5050 1334.2023 1334.9133 1344.7007 1344.8670 1356.5477 1362.5879 1368.2625 1370.8588 1383.6821 1401.9459 1434.2336 1437.7116 1448.6623 1455.0230 1458.1075 1460.2585 1466.1057 1467.3335 1470.6509 1480.9137 1486.3452 1487.7243 1495.9973 1508.7407 1577.7502 1616.7285 2865.8714 2880.6785 2952.5206 2959.6530 2960.6233 2962.2502 2965.6137 2975.9142 2977.3589 2978.7225 2980.9343 3004.1973 3009.0194 3015.4056 3019.8107 3027.3265 3032.8554 3040.2011 3043.5649 3062.1200 3072.3738 3104.7547 3121.6773 3150.5795 3163.7393 3430.2994
redmass: 3.7742 3.5088 3.5230 3.2314 2.4975 3.1334 2.6719 2.8656 2.3584 2.3161 1.4336 3.0428 2.5719 2.1103 2.6662 2.5971 2.2019 2.5330 3.8526 2.5485 3.0821 2.9244 2.8388 2.7204 3.2181 3.3703 3.3353 2.3153 4.1464 1.3825 2.4282 3.3282 1.5148 1.9999 1.8410 1.7401 2.3979 1.4849 2.3951 2.8115 2.2784 2.0067 1.5815 1.7465 1.5866 1.3079 2.0571 2.0525 1.8318 2.3558 2.0786 1.7957 1.9469 1.6874 2.3570 1.6121 1.3344 1.7144 1.6821 1.7342 1.9513 2.6199 1.4281 1.4777 1.5664 1.7372 1.8484 1.3381 1.3472 1.5792 1.3066 1.4195 1.3457 1.4582 1.4169 1.3947 1.5419 1.4694 1.4117 1.4333 1.3379 1.3760 1.5365 1.3747 1.3396 5.9917 1.6100 1.1413 1.1976 2.1659 1.1320 1.1153 1.0946 1.0682 1.0859 1.0934 1.1057 1.1073 1.2317 1.0763 2.2610 6.7308 6.4272 1.0707 1.0554 1.0675 1.0655 1.0677 1.0637 1.0756 1.0702 1.0682 1.0734 1.0620 1.0860 1.0775 1.0987 1.0974 1.0951 1.1029 1.0954 1.1030 1.0956 1.0992 1.0879 1.0873 1.0929 1.0980 1.0741
irintensity: 0.0857 0.5553 0.1522 0.7613 2.2959 0.5572 1.4545 0.2346 0.4037 1.1146 3.6166 1.5244 3.8469 3.2073 1.0087 1.9575 0.1155 0.7391 8.4303 4.2357 3.8094 1.6318 2.0619 0.1795 1.4425 0.8593 2.0924 3.4379 3.8692 95.5547 12.3853 5.0426 86.8350 2.9910 4.2113 16.3519 2.8332 0.6960 1.9553 2.6994 11.8745 2.5031 6.0138 5.8301 1.1343 0.0336 1.0829 0.2536 4.8916 16.4709 1.8840 3.6022 18.8100 4.0181 4.3426 2.8435 3.2068 1.0136 8.4612 1.5891 16.1845 29.8690 19.9190 14.5134 23.3946 13.8443 2.6380 8.9311 11.5103 17.9893 2.3060 8.1135 64.5624 22.2340 20.3118 5.0246 7.7984 16.1930 0.2121 1.0667 1.6255 5.7408 16.6914 13.2049 7.9032 10.4669 2.5588 2.8638 19.2211 28.3918 1.5128 4.4078 6.7369 8.7844 12.0846 10.6850 15.3854 4.9131 43.0007 7.1740 146.6471 11.8322 110.3380 77.1500 198.8948 14.2430 25.5090 19.2636 33.7716 32.4477 66.0012 68.7891 17.9784 36.6713 50.3584 35.8510 29.3478 77.1534 51.2505 21.3984 21.0434 88.4341 37.3422 42.0869 16.7382 14.6692 42.2980 24.1209 1.5223
temp: 298.150 k
press: 1.00000 atm
elementType: 7 7 6 6 6 6 6 6 6 6 6 6 6 6 6 6 6 6 6 1 1 1 1 1 1 1 1 1 1 1 1 1 1 1 1 1 1 1 1 1 1 1 1 1 1
symmnumber: 1
zpe: 1047156.3 jmol-1
zpe.correction: 0.398841 hartree
zpe.thermalcorrener: 0.416975 hartree
zpe.thermalcorrenthalpy: 0.417920 hartree
zpe.thermalcorrgfe: 0.352122 hartree
zpe.sumelectzpe: -771.442086 hartree
zpe.sumelectthermal: -771.423952 hartree
zpe.sumelectthermalent: -771.423007 hartree
zpe.sumelectthermalfe: -771.488805 hartree
dipole: 3.3898 -0.5884 -0.0286
dipole: 3.4406
quadrupole: -115.1205 -107.7583 -117.1272
quadrupole: -4.9505 0.6388 -3.9387
quadrupole: -1.7852 5.5770 -3.7919 -4.9505 0.6388 -3.9387
hfenergy: -771.840927 hartree
pointgroup: C01 [X(C17H26N2)]
dipole: 1.3231711 -0.2842083 -0.0286922 debye
polarizability: 237.3078912|11.5395781|197.1231805|11.5904547|-14.3228333|145.520733 unknown
InChI: InChI=1S/C17H26N2/c1-18-11-6-12-19-16-9-4-2-7-14(16)13-15-8-3-5-10-17(15)19/h2,4,7,9,15,17-18H,3,5-6,8,10-13H2,1H3
charge 0 multiplicity 1
45 atoms
N  -0.026991 -0.562696 0.570007
N  3.15584 -2.141955 -0.268526
C  0.47186 1.428338 -0.857663
C  0.877866 0.601967 0.389921
C  1.435064 2.631207 -1.041538
C  0.961925 1.48583 1.665613
C  -1.011613 1.851906 -0.759144
C  1.560732 3.509317 0.228429
C  1.95208 2.658071 1.459366
C  -1.916323 0.670755 -0.435617
C  -1.386129 -0.49249 0.223528
C  0.542755 -1.748511 1.229622
C  0.839412 -2.927448 0.263025
C  -3.284079 0.710335 -0.778413
C  -2.282341 -1.572117 0.505059
C  -4.166209 -0.355175 -0.487287
C  -3.646605 -1.49822 0.160394
C  1.856678 -2.568309 -0.838238
C  4.146588 -1.708296 -1.273524
H  0.570128 0.7625 -1.740471
H  1.889748 0.184066 0.208789
H  1.097857 3.246788 -1.899548
H  2.442302 2.244829 -1.304512
H  1.28122 0.859329 2.521397
H  -0.043815 1.875231 1.917141
H  -1.329276 2.315566 -1.713043
H  -1.125798 2.637716 0.015123
H  0.600607 4.024565 0.430484
H  2.313017 4.303922 0.057977
H  2.973579 2.249003 1.309972
H  1.990985 3.289148 2.368236
H  1.495733 -1.443053 1.695717
H  -0.120828 -2.098232 2.046182
H  1.218267 -3.784168 0.860951
H  -0.095744 -3.263919 -0.222375
H  -3.664421 1.605121 -1.289297
H  -1.917264 -2.475587 1.001677
H  1.455397 -1.727201 -1.437331
H  1.960417 -3.435736 -1.53765
H  -5.224033 -0.296908 -0.763743
H  -4.303327 -2.34392 0.397227
H  3.539813 -2.866154 0.35521
H  4.362308 -2.468597 -2.063569
H  5.097706 -1.449639 -0.774993
H  3.777512 -0.798678 -1.784064
