program: Gaussian 09
title: 000029266
version: EM64L-G09RevD.01
frameworkgroup: C1[X(C20H24NO2)]
method: RPBEPBE
basis: SDD
operation: Freq
keyword: #p
keyword: freq=noraman
keyword: PBEPBE/SDD
title: #p freq=noraman PBEPBE/SDD
converged: YES YES NO NO
title: Mulliken charges:
elementType: O O N C C C C C C C C C C C C C C C C C C C C H H H H H H H H H H H H H H H H H H H H H H H H
charge: -0.301807 -0.319793 -0.043395 -0.086250 -0.571130 -0.460829 -0.439662 0.257157 0.320858 0.393419 0.370950 -0.446549 -0.437142 -0.447131 -0.455841 -0.278236 -0.414799 -0.248577 -0.225326 -0.227269 -0.225212 -0.535727 -0.518364 0.265173 0.259356 0.211563 0.238716 0.255748 0.269379 0.265946 0.261362 0.253321 0.187177 0.263142 0.285331 0.309021 0.245062 0.237795 0.247511 0.240680 0.276603 0.289767 0.264920 0.284652 0.256595 0.287952 0.383881
chargesum: 1.00000
title: Mulliken charges with hydrogens summed into heavy atoms:
elementType: O O N C C C C C C C C C C C C C C C C C C C C
charge: -0.301807 0.064088 -0.043395 -0.086250 -0.305956 0.010090 0.054802 0.257157 0.320858 0.393419 0.370950 -0.177170 -0.171196 -0.185769 -0.202519 0.172083 0.179553 -0.003515 0.012469 0.020242 0.015468 0.295563 0.310835
polarizability: 2.74357531e+02 -1.54448698e-01 2.30345489e+02 4.11199155e+00 4.91874158e+00 1.64843151e+02
1716.lowfreq: -8.9400 -4.5633 -0.0010 -0.0004 -0.0003 4.6491 18.3274 39.1773 56.9559
frequency: 17.3772 38.7686 56.9063 71.5095 84.9330 131.3961 138.2175 159.0074 162.5752 189.9572 203.7319 216.0665 226.7200 246.6256 254.5436 316.3277 329.7197 335.1322 341.9074 352.2901 373.7050 395.9737 413.3732 433.2090 435.8438 451.0105 470.7821 473.7980 504.8529 529.2700 554.6656 576.2736 585.0872 605.1212 628.7808 671.0497 704.2684 717.8533 748.1242 764.5722 772.9492 778.5855 807.4091 811.3487 819.4662 828.6372 849.5016 881.2728 887.6996 892.7546 901.0041 914.5716 939.5225 949.9427 956.7281 978.9256 993.9568 997.4413 1003.8634 1017.0046 1021.1629 1024.3160 1031.3605 1040.4319 1049.4086 1085.9602 1094.9444 1100.9929 1119.8152 1141.4919 1147.4262 1164.7201 1166.9050 1173.7807 1176.8660 1182.7083 1191.3186 1201.2100 1208.2967 1217.2307 1238.3843 1244.8630 1261.1659 1274.4232 1279.8802 1301.6356 1311.0038 1324.2306 1330.2014 1358.3433 1385.3413 1391.3046 1393.2343 1414.7908 1433.0081 1441.0262 1442.0520 1446.8390 1452.4760 1454.5271 1462.2897 1463.1467 1466.5418 1467.1578 1484.5430 1487.0422 1491.4567 1584.6015 1595.3189 1604.9140 1618.8077 2935.9698 2997.3416 3017.1085 3022.3006 3030.1204 3035.2764 3040.8733 3061.9891 3069.3534 3089.2829 3096.7085 3115.0352 3132.9345 3136.8260 3143.9256 3144.4201 3147.3137 3157.1940 3160.1278 3164.2731 3168.4259 3169.6638 3172.1089 3173.5588
redmass: 4.7435 3.9125 3.9575 4.7449 3.6174 3.6490 3.2939 3.6235 3.7124 1.0944 2.0153 2.7236 4.3040 2.4944 1.1723 3.8929 2.5215 2.4398 2.7421 3.9910 3.2858 2.6106 4.5088 4.1346 2.8253 3.0004 3.0286 3.1662 4.0560 3.3599 4.2361 4.2350 4.7145 4.0598 5.3138 6.0734 3.6217 5.5446 3.2261 1.9209 1.3692 1.4186 3.5958 1.8375 4.4829 2.8451 4.3586 2.0364 1.3737 1.8042 1.8005 2.6001 2.9407 1.4450 1.4102 3.1029 1.3503 1.3524 3.7970 3.4169 2.7188 2.4261 2.3696 3.7161 2.2172 1.8803 1.4404 1.8055 1.6857 1.6077 1.3947 1.3658 1.5276 1.3291 1.5053 1.4716 1.9826 1.3554 1.5896 1.9417 1.2167 1.3121 1.8578 1.3117 1.4981 1.4846 1.5691 1.3983 1.3342 1.3161 1.4967 3.6778 6.3599 1.1342 1.1224 2.0602 1.1508 2.4372 2.1903 1.1088 1.1281 1.0505 1.6454 1.1439 1.3323 1.0556 1.0805 6.4918 6.9942 6.9679 7.2119 1.0632 1.0596 1.0960 1.0615 1.0326 1.0366 1.0548 1.1033 1.0882 1.1056 1.0857 1.1077 1.0873 1.0882 1.0899 1.0931 1.1042 1.1057 1.0943 1.1055 1.0929 1.1039 1.0819 1.0980
irintensity: 6.9596 2.7196 2.8708 0.8835 3.4250 0.7363 0.7964 0.7684 4.9458 0.0617 0.7730 7.3566 2.9207 1.5737 1.6392 5.6835 26.3533 73.1851 10.4884 6.0308 34.2896 16.2873 0.5903 0.9275 15.3502 8.7979 23.8036 9.0700 7.3620 6.2683 16.6479 14.2810 5.2741 2.3685 4.5075 11.4858 3.3906 3.9440 7.2448 8.6587 66.9597 63.2602 3.0100 5.5574 3.9283 0.1633 2.8618 7.7358 2.2404 10.3950 2.7693 19.3509 10.3079 7.4192 1.2346 0.3728 1.5884 0.2169 4.8018 46.5502 59.7165 5.5675 3.0791 14.0663 0.4514 20.4936 3.1515 1.6375 7.8426 4.9636 13.0584 10.6691 6.8392 1.9531 23.9866 3.1302 0.9249 2.3355 11.6325 21.8536 3.0797 1.3651 4.9684 1.3951 2.2361 27.0878 5.0096 0.9129 5.7434 60.9826 7.0937 2.0385 2.2667 6.6872 2.9932 9.7301 7.9522 18.7789 23.2489 42.3527 6.1238 17.9213 1.6826 21.1147 14.1321 47.1789 4.6788 3.6953 0.1268 1.9195 0.2050 39.3428 37.1882 22.1060 41.4935 0.7852 0.6773 6.0891 5.1492 20.4285 36.0598 48.7274 2.0066 1.4859 0.0319 5.3020 10.7194 2.8426 1.5044 14.7189 1.0594 234.7259 19.2574 496.1453 44.6579
temp: 298.150 k
press: 1.00000 atm
elementType: 8 8 7 6 6 6 6 6 6 6 6 6 6 6 6 6 6 6 6 6 6 6 6 1 1 1 1 1 1 1 1 1 1 1 1 1 1 1 1 1 1 1 1 1 1 1 1
symmnumber: 1
zpe: 1039082.0 jmol-1
zpe.correction: 0.395765 hartree
zpe.thermalcorrener: 0.416236 hartree
zpe.thermalcorrenthalpy: 0.417180 hartree
zpe.thermalcorrgfe: 0.347047 hartree
zpe.sumelectzpe: -979.728942 hartree
zpe.sumelectthermal: -979.708471 hartree
zpe.sumelectthermalent: -979.707527 hartree
zpe.sumelectthermalfe: -979.777661 hartree
dipole: -13.2923 -2.1597 2.0469
dipole: 13.6213
quadrupole: -42.0526 -116.0281 -124.5482
quadrupole: 20.5740 0.0661 1.5718
quadrupole: 52.1570 -21.8185 -30.3386 20.5740 0.0661 1.5718
hfenergy: -980.1247071 hartree
pointgroup: C01 [X(C20H24N1O2)]
dipole: 5.2747433 -0.6240268 -0.7119074 debye
polarizability: 274.0779449|2.161605|230.4141995|6.2149583|-4.8869629|165.0540267 unknown
InChI: InChI=1S/C20H24NO2/c1-21(2,22)13-14-23-20-12-11-15(16-7-3-5-9-18(16)20)17-8-4-6-10-19(17)20/h3-10,15,22H,11-14H2,1-2H3
charge 1 multiplicity 1
47 atoms
O  0.816325 -1.42611 -0.092768
O  3.951083 0.978861 0.47172
N  4.367071 -0.407608 0.080925
C  -0.336399 -0.589692 -0.507013
C  -2.408493 0.886278 -1.110561
C  -0.522777 -0.548213 -2.072801
C  -1.766837 0.327162 -2.434105
C  -0.216236 0.848513 0.003626
C  -1.634634 -1.154727 0.062838
C  -1.317947 1.660917 -0.375402
C  -2.755773 -0.340463 -0.261024
C  0.787456 1.35682 0.856535
C  -1.782823 -2.338762 0.805054
C  -1.351118 3.015998 0.010088
C  -4.041103 -0.722107 0.166173
C  2.054805 -1.124717 -0.801601
C  3.194983 -1.399805 0.202821
C  0.745786 2.719277 1.253032
C  -3.079099 -2.712907 1.239225
C  -0.303994 3.551921 0.801787
C  -4.199488 -1.910372 0.922536
C  4.946333 -0.337364 -1.324542
C  5.449477 -0.728898 1.100499
H  -3.290973 1.507754 -1.33283
H  -0.650413 -1.587004 -2.424546
H  0.378452 -0.128163 -2.556097
H  -1.476865 1.167939 -3.087864
H  -2.519581 -0.274571 -2.970694
H  1.476519 0.656813 1.34963
H  -0.910738 -2.955712 1.039128
H  -2.198232 3.648868 -0.277064
H  -4.912381 -0.104761 -0.079866
H  2.066924 -0.062732 -1.132112
H  2.153062 -1.757324 -1.704114
H  3.633932 -2.403868 0.076729
H  2.804158 -1.303516 1.229403
H  1.502106 3.117748 1.938481
H  -3.214363 -3.628911 1.824024
H  -0.334204 4.603003 1.106249
H  -5.196213 -2.208008 1.264903
H  4.16085 -0.027718 -2.027321
H  5.752599 0.409365 -1.318637
H  5.337623 -1.330468 -1.598432
H  4.986392 -0.773261 2.095674
H  5.908643 -1.693875 0.8354
H  6.194092 0.078873 1.070237
H  2.973914 1.105828 0.221774
