program: Gaussian 09
title: 000029193
version: EM64L-G09RevD.01
frameworkgroup: C1[X(C14H22N2O2)]
method: RPBEPBE
basis: SDD
operation: Freq
keyword: #p
keyword: freq=noraman
keyword: PBEPBE/SDD
title: #p freq=noraman PBEPBE/SDD
converged: YES YES NO NO
title: Mulliken charges:
elementType: O O N N C C C C C C C C C C C C C C H H H H H H H H H H H H H H H H H H H H H H
charge: -0.351024 -0.259853 -0.223222 -0.382951 -0.218131 0.455871 0.173178 0.053856 0.360973 -0.428978 -0.714732 -0.699028 -0.439028 -0.826394 -0.626405 -0.624853 0.286622 -0.607555 0.226220 0.228381 0.204982 0.211448 0.225147 0.250207 0.204653 0.212399 0.225792 0.222429 0.246519 0.221889 0.231774 0.239003 0.204291 0.238799 0.205176 0.214102 0.328339 0.229642 0.272082 0.228381
chargesum: 0.00000
title: Mulliken charges with hydrogens summed into heavy atoms:
elementType: O O N N C C C C C C C C C C C C C C
charge: -0.351024 -0.259853 -0.223222 -0.054612 0.008089 0.455871 0.173178 0.053856 0.360973 -0.200597 -0.073155 -0.031770 -0.213236 -0.135556 0.048663 0.033222 0.286622 0.122549
polarizability: 2.02439840e+02 -2.31480543e+00 2.02426376e+02 1.21457002e+01 -1.44293206e+00 1.24053364e+02
1716.lowfreq: -17.7030 -7.3950 0.0007 0.0008 0.0010 7.4597 14.8784 37.3836 45.5009
frequency: -8.5945 37.2488 45.4375 52.5393 80.6076 103.5592 108.1991 114.9853 126.9359 150.7376 158.3789 172.7081 199.2144 209.4610 225.5732 230.1125 236.5091 250.4150 258.0996 275.8133 295.4904 319.5163 340.0125 360.7034 381.6498 414.0125 426.1356 473.1732 515.9077 545.8341 575.5319 584.1194 642.4164 661.4407 670.7160 689.7797 710.6732 779.0607 811.2150 822.6645 862.9853 896.2710 919.9891 940.5999 944.6816 959.1263 986.3254 1021.5585 1044.6547 1057.3353 1061.5478 1084.0625 1094.2732 1115.5963 1128.0068 1133.4991 1139.4306 1146.9883 1165.9563 1175.7399 1195.9742 1214.6415 1246.9076 1262.0908 1306.5426 1323.7879 1333.4432 1363.4303 1375.5935 1388.1115 1393.2903 1419.5017 1426.9330 1431.1193 1442.7549 1455.4124 1457.5433 1459.6635 1464.5744 1467.6756 1470.6001 1475.6090 1480.5429 1482.6615 1484.3348 1490.3509 1490.5948 1512.8825 1514.1658 1573.3259 1608.0877 1687.9141 2909.7931 2926.8964 2966.2255 2970.6733 2975.8618 2979.2372 2987.1474 3006.2630 3010.8898 3045.3958 3056.8782 3063.4833 3071.9684 3076.8575 3081.5570 3084.5043 3098.5634 3103.2863 3111.4627 3116.3385 3147.6074 3572.8592
redmass: 2.7634 3.9771 3.8660 4.6655 3.1403 2.2168 3.1186 1.1158 1.6972 2.5926 2.9751 1.0762 2.2479 2.4255 1.3501 1.1474 2.2921 1.8906 1.3704 2.9504 3.5659 4.0025 3.9274 3.2507 3.6388 4.1261 3.0570 3.8589 4.0840 3.7931 1.1159 3.3244 4.4162 5.3559 5.1590 11.5997 5.0245 5.0944 4.9296 1.4202 4.3716 2.7332 1.2041 2.8549 1.3617 1.4406 2.0607 2.1181 1.5168 1.4518 1.7088 3.5061 1.2688 2.6215 1.2825 1.7930 1.8112 1.6639 2.1505 1.3271 2.1982 4.6356 3.9935 1.7641 1.5318 1.5289 3.2382 3.7086 1.1945 1.2831 1.2089 2.0801 1.1989 1.1615 1.2961 1.1671 1.1742 1.1107 1.0971 1.1308 1.0621 1.4386 1.0898 1.1548 1.0488 1.0737 1.1297 1.3842 1.3613 5.5326 7.4136 9.1931 1.0466 1.0453 1.0396 1.0348 1.0352 1.0355 1.0890 1.0926 1.0840 1.0926 1.1027 1.0999 1.0986 1.1004 1.0998 1.1000 1.0949 1.0951 1.0982 1.0875 1.0951 1.0771
irintensity: 0.1257 1.1749 1.7848 3.4256 3.0502 4.7303 3.8190 0.1761 1.8067 2.0147 0.7974 0.6844 5.2503 0.6131 0.2780 0.4837 1.2450 0.1419 0.4907 2.5624 3.2665 14.3661 12.3163 4.3282 2.3680 4.9575 1.0197 1.2714 1.3668 2.3392 121.4186 2.0978 1.1075 1.4092 7.1872 20.0331 0.9336 2.9878 4.5392 31.1417 25.0988 14.5077 1.3977 22.6038 1.0424 0.4630 37.4369 74.3757 7.4355 9.1041 22.8951 250.1071 25.6305 4.2848 0.4339 29.5481 43.1858 16.5013 52.7316 19.3318 158.7722 19.8719 17.6477 9.1103 6.2964 4.2236 18.7515 6.9974 15.9257 17.4032 12.2541 83.4202 25.3155 24.7142 9.1130 52.6249 73.7267 39.6295 7.9293 3.4710 2.3206 26.6928 14.3432 4.9635 11.1628 15.3479 18.1450 35.9438 112.7084 22.8442 17.0585 231.5958 101.5155 127.0828 47.8011 31.7810 44.9663 86.3594 77.6026 42.9309 3.0064 24.9342 32.9534 1.2737 98.7612 21.8684 35.4082 16.4352 16.1776 22.9149 3.9796 15.4798 23.5982 35.5299
temp: 298.150 k
press: 1.00000 atm
elementType: 8 8 7 7 6 6 6 6 6 6 6 6 6 6 6 6 6 6 1 1 1 1 1 1 1 1 1 1 1 1 1 1 1 1 1 1 1 1 1 1
symmnumber: 1
zpe: 885230.8 jmol-1
zpe.correction: 0.337167 hartree
zpe.thermalcorrener: 0.357275 hartree
zpe.thermalcorrenthalpy: 0.358219 hartree
zpe.thermalcorrgfe: 0.289178 hartree
zpe.sumelectzpe: -805.247588 hartree
zpe.sumelectthermal: -805.227479 hartree
zpe.sumelectthermalent: -805.226535 hartree
zpe.sumelectthermalfe: -805.295576 hartree
dipole: 2.2934 -0.8564 1.8599
dipole: 3.0745
quadrupole: -91.2788 -101.8935 -113.4286
quadrupole: -1.6545 7.3524 -0.9486
quadrupole: 10.9215 0.3068 -11.2283 -1.6545 7.3524 -0.9486
hfenergy: -805.5847545 hartree
pointgroup: C01 [X(C14H22N2O2)]
dipole: 0.6711504 -0.6389807 0.7774423 debye
polarizability: 198.1921055|-1.9794227|204.1364351|18.1486288|-2.627996|126.59104 unknown
InChI: InChI=1S/C14H22N2O2/c1-9(2)11-8-7-10(3)12(16(5)6)13(11)18-14(17)15-4/h7-9,15H,1-6H3
charge 0 multiplicity 1
40 atoms
O  0.960835 -0.377911 0.862035
O  1.622034 -1.070675 -1.316898
N  -1.387104 -1.93906 0.246501
N  2.856748 -1.589577 0.619234
C  1.097586 2.470295 0.511449
C  -0.182474 1.679209 0.226021
C  -1.364062 -0.526346 0.055509
C  -0.219388 0.271448 0.359466
C  -2.532303 0.144284 -0.434983
C  -1.353028 2.307418 -0.263871
C  0.831682 3.78317 1.288374
C  1.853054 2.756095 -0.818222
C  -2.495228 1.549577 -0.591957
C  -3.807093 -0.622648 -0.730113
C  -1.451862 -2.819325 -0.932807
C  -0.800703 -2.55485 1.444039
C  1.811037 -1.029404 -0.07843
C  3.936486 -2.320169 -0.047936
H  1.750512 1.834221 1.13793
H  -1.371965 3.395559 -0.386288
H  0.233521 4.496826 0.691704
H  1.788721 4.280494 1.533367
H  0.289775 3.590168 2.231872
H  2.062987 1.820016 -1.365796
H  2.811259 3.272256 -0.618641
H  1.245238 3.402935 -1.47842
H  -3.395575 2.060926 -0.954186
H  -3.836935 -1.002555 -1.770718
H  -3.890153 -1.498089 -0.061943
H  -4.692502 0.022439 -0.593856
H  -0.438543 -3.081748 -1.310345
H  -1.990639 -2.321087 -1.753574
H  -1.988438 -3.755497 -0.681142
H  -0.801545 -1.834085 2.276791
H  0.24351 -2.914591 1.301358
H  -1.418156 -3.428191 1.738345
H  2.866941 -1.455829 1.630684
H  4.915164 -1.833175 0.11892
H  3.725068 -2.322916 -1.129063
H  3.992238 -3.366811 0.304492
