program: Gaussian 09
title: 000029159
version: EM64L-G09RevD.01
frameworkgroup: C1[X(C12H7NO)]
method: RPBEPBE
basis: SDD
operation: Freq
keyword: #p
keyword: freq=noraman
keyword: PBEPBE/SDD
title: #p freq=noraman PBEPBE/SDD
converged: NO YES YES YES
title: Mulliken charges:
elementType: O N C C C C C C C C C C C C H H H H H H H
charge: -0.143119 0.009428 0.268094 0.224731 0.215991 0.304263 -0.285924 -0.390814 -0.409062 -0.332067 -0.484875 -0.211678 -0.228048 -0.334311 0.252280 0.281396 0.273747 0.262614 0.235429 0.239974 0.251952
chargesum: 0.00000
title: Mulliken charges with hydrogens summed into heavy atoms:
elementType: O N C C C C C C C C C C C C
charge: -0.143119 0.009428 0.268094 0.224731 0.215991 0.304263 -0.285924 -0.138534 -0.127666 -0.058319 -0.222261 0.023751 0.011926 -0.082360
polarizability: 2.13791407e+02 -5.44998371e+00 1.50454749e+02 -5.19608497e-03 6.43023353e-05 5.13842039e+01
1716.lowfreq: -8.3753 -0.0008 0.0003 0.0003 6.6230 10.8903 99.8635 132.2339 149.2330
frequency: 99.8558 132.2335 149.2330 198.5412 261.4679 270.8161 389.4434 405.8026 425.0701 446.3463 499.0695 548.8700 575.3993 631.6923 642.5921 687.2893 725.8032 759.7144 769.3381 783.0162 828.8056 867.8523 902.7663 908.8924 929.6110 971.6554 973.5414 979.6989 1001.6019 1016.9207 1043.6971 1083.8750 1122.5047 1163.6123 1173.7428 1199.1158 1216.0886 1290.3014 1299.4028 1309.4108 1393.8786 1402.8118 1438.4957 1450.6119 1472.3690 1566.0916 1589.3875 1600.8995 1612.9419 1638.8007 3131.8326 3134.1471 3142.0685 3145.0673 3154.2813 3166.8822 3169.7145
redmass: 4.6738 4.1585 8.1274 5.1278 4.1510 9.7969 3.0037 6.9657 3.7182 4.4432 6.2186 9.0270 3.9767 7.3972 7.1541 3.7183 6.2644 1.4895 7.1337 2.5566 2.2586 1.5982 7.0926 1.6485 1.5395 1.4313 5.9792 1.4961 1.3622 2.2094 2.0042 2.3198 3.8667 1.9113 1.2349 2.2230 2.5391 1.9413 2.7814 1.8541 2.9626 2.0342 2.3524 2.4844 3.8175 7.3302 8.0934 7.1609 7.7316 11.0446 1.0893 1.0885 1.0900 1.0901 1.0953 1.0974 1.1004
irintensity: 2.3720 1.5409 2.1441 0.3577 1.3240 5.1208 5.7631 0.1970 0.0102 0.4227 4.2005 0.9277 4.8106 0.1555 6.8592 28.1009 1.9826 53.6392 1.4930 37.2793 0.4435 30.5814 26.6963 2.3315 0.9009 2.5702 4.6559 2.9750 0.0361 0.7516 0.5219 6.6753 16.1468 13.8574 3.5654 50.8241 0.9710 2.6867 35.9715 8.2324 16.4382 11.2881 38.6121 1.3105 0.3706 0.2652 64.6232 14.4925 80.4072 102.9374 12.3723 3.6611 6.9391 3.2234 14.0118 18.0109 22.5183
temp: 298.150 k
press: 1.00000 atm
elementType: 8 7 6 6 6 6 6 6 6 6 6 6 6 6 1 1 1 1 1 1 1
symmnumber: 1
zpe: 406102.1 jmol-1
zpe.correction: 0.154676 hartree
zpe.thermalcorrener: 0.164296 hartree
zpe.thermalcorrenthalpy: 0.165240 hartree
zpe.thermalcorrgfe: 0.119435 hartree
zpe.sumelectzpe: -590.521419 hartree
zpe.sumelectthermal: -590.511799 hartree
zpe.sumelectthermalent: -590.510855 hartree
zpe.sumelectthermalfe: -590.556660 hartree
dipole: 2.4982 -1.7855 -0.0002
dipole: 3.0707
quadrupole: -69.5811 -84.2163 -83.1287
quadrupole: -9.2828 0.0012 -0.0002
quadrupole: 9.3942 -5.2409 -4.1533 -9.2828 0.0012 -0.0002
hfenergy: -590.6760951 hartree
pointgroup: C01 [X(C12H7N1O1)]
dipole: 0.9760635 0.7118902 0.0000766 debye
dipolederiv: -0.50458 -0.0152087 -0.0000117 -0.0802861 -1.0231462 0.0003779 -0.0000512 -0.0003102 -0.2926852 -0.2789045 -0.0094461 0.0000559 0.0263993 -0.3260547 0.0000414 -0.000129 0.0000757 -0.2501588 0.2124357 0.1144422 0.0000391 0.0838247 0.0780338 -0.000039 0.0002741 0.0000748 -0.0054844 0.2839036 -0.0695234 -0.0000133 -0.0338792 -0.1419416 -0.0000066 -0.00027 0.0000718 0.0371693 -0.6720812 -0.2788103 0.0000345 -0.1601352 -0.2878603 0.0000099 0.000103 0.0000807 0.0298577 -0.4437931 0.1933954 -0.0000267 0.1120682 -0.1100626 -0.0000024 -0.0001797 0.0000754 0.046304 1.2332805 0.1124671 0.0000257 0.1164426 1.2203885 -0.0003847 0.0001149 0.0000102 0.1131765 -0.3336961 -0.1870913 0.0000244 -0.081462 0.0785181 0.0000051 -0.0000275 -0.0000321 -0.1410266 0.1196077 0.0550382 -0.0000337 -0.146275 0.1444176 -0.0000049 -0.0000238 0.0000021 -0.1087835 -0.1286899 0.0008263 -0.000046 0.268696 0.062927 0.0000328 0.000013 -0.0000129 -0.0639127 -0.1357523 0.0344543 -0.0000411 0.1093332 0.3267147 0.0000142 0.0000934 -0.0001197 -0.0614646 0.1594547 0.1250607 -0.0000655 0.092401 0.0570564 -0.0000004 -0.0000667 -0.0000142 -0.1207333 0.0744181 -0.0253634 -0.000056 -0.0419637 -0.1463678 0.0000175 -0.0000423 0.0000239 -0.1699335 0.3401981 0.0720616 0.0001143 -0.1136966 0.0789196 -0.000049 0.0001601 -0.0000033 -0.0847647 0.0723318 0.0778138 0.000007 0.0375936 -0.0583266 0.0000066 -0.0000355 0.000027 0.1565683 0.0828044 0.0155263 0.000013 0.0680203 -0.0209734 -0.0000026 0.0000165 0.0000255 0.1610127 0.0908747 -0.0149987 -0.0000125 -0.075743 -0.0206168 -0.0000092 -0.0000394 0.0000342 0.1566838 0.0679132 -0.0751448 -0.0000114 -0.0634177 -0.0580085 -0.000003 0.0000578 0.0000279 0.1343686 -0.0167149 -0.0958223 0.0000179 -0.1137089 -0.0159252 0.0000174 0.0000614 0.0000281 0.1552363 -0.1153137 0.0254008 0.0000379 0.0339329 0.0858349 -0.000011 0.0000477 -0.000035 0.1657741 -0.1076969 -0.0550776 -0.0000517 -0.0381442 0.0764732 -0.00001 -0.0000769 -0.0000296 0.1427961 unknown
polarizability: 213.6808759|6.0572895|150.5652799|0.0051952|0.0001142|51.3842039 unknown
InChI: InChI=1S/C12H7NO/c14-12-9-4-2-1-3-8(9)11-7-13-6-5-10(11)12/h1-7H
charge 0 multiplicity 1
21 atoms
O  0.018064 -2.866778 0.000266
N  -3.065221 1.408274 -0.000061
C  0.735967 0.672784 0.00058
C  -0.752414 0.658974 0.000509
C  1.19786 -0.679189 0.000525
C  -1.194291 -0.697364 0.000429
C  0.015434 -1.606783 0.001031
C  1.65909 1.732308 0.00042
C  2.566598 -0.990441 0.000219
C  -2.561075 -0.999374 0.000031
C  -1.718908 1.681991 0.000278
C  3.045959 1.421276 0.000192
C  3.498385 0.079088 0.00009
C  -3.462388 0.101759 -0.000186
H  1.329377 2.776646 0.000374
H  2.895429 -2.035006 0.000209
H  -2.920471 -2.032868 0.000001
H  -1.450211 2.744016 0.000212
H  3.77919 2.235512 0.000048
H  4.573131 -0.130378 -0.000067
H  -4.545404 -0.062246 -0.000401
