program: Gaussian 09
title: 000029281
version: EM64L-G09RevD.01
frameworkgroup: C1[X(C20H25F3N2O)]
method: RPBEPBE
basis: SDD
operation: Freq
keyword: #p
keyword: freq=noraman
keyword: PBEPBE/SDD
title: #p freq=noraman PBEPBE/SDD
converged: YES YES NO NO
title: Mulliken charges:
elementType: F F F O N N C C C C C C C C C C C C C C C C C C C C H H H H H H H H H H H H H H H H H H H H H H H H H
charge: -0.169043 -0.161392 -0.167598 -0.287927 -0.026707 -0.079136 -0.390132 -0.566062 -0.386610 0.231109 -0.394971 -0.503522 -0.033053 0.134539 0.274741 -0.055878 -0.296643 -0.352538 -0.493578 -0.410061 0.315857 -0.327810 -0.351400 0.243892 -0.626378 -0.613906 0.247010 0.212949 0.197303 0.210147 0.207711 0.189222 0.211200 0.212679 0.201324 0.243144 0.212893 0.210727 0.263526 0.230437 0.223467 0.297523 0.175106 0.204526 0.258570 0.238380 0.222747 0.186081 0.224427 0.188215 0.224897
chargesum: 0.00000
title: Mulliken charges with hydrogens summed into heavy atoms:
elementType: F F F O N N C C C C C C C C C C C C C C C C C C C C
charge: -0.169043 -0.161392 -0.167598 -0.287927 -0.026707 -0.079136 0.017318 -0.106103 0.010323 0.231109 0.028909 -0.059055 -0.033053 0.134539 0.274741 -0.055878 0.126977 -0.089012 -0.196055 0.043844 0.315857 0.051822 -0.092831 0.243892 0.020830 0.023633
polarizability: 2.89975152e+02 2.72565238e+01 2.97852442e+02 -8.85893276e+00 6.15466591e+00 1.53270268e+02
1716.lowfreq: -6.8723 -3.9153 -0.0004 0.0001 0.0006 2.0576 5.7795 11.1699 22.0368
frequency: 5.4321 10.6471 21.8977 32.6972 43.1296 59.4267 76.4209 83.6049 88.0776 106.1770 115.2526 134.1150 150.0365 179.0649 197.3842 209.9295 223.3461 231.3605 238.2954 258.2310 275.5801 287.5703 314.3378 330.5186 335.0677 340.8216 358.9420 368.2492 378.0582 410.0381 426.3164 448.0470 462.5761 473.0974 487.0048 495.3489 512.4386 527.6186 570.4529 583.3121 629.1337 646.3738 658.6141 676.0209 707.3322 732.8649 762.0661 770.3896 800.3736 807.4393 828.7567 835.9869 845.0013 867.0488 872.2240 877.4728 898.3274 924.8362 930.5790 955.1851 959.5034 973.7243 982.7061 1022.3003 1022.9279 1028.2304 1033.4689 1034.7519 1045.3796 1067.8169 1070.0257 1080.4628 1093.6586 1098.4933 1111.9076 1123.5110 1132.2024 1141.5250 1166.0585 1170.0046 1201.4721 1204.8072 1210.7977 1215.3926 1248.8349 1251.7786 1259.5577 1269.1588 1270.6522 1288.8924 1293.9681 1297.0155 1314.3804 1317.7605 1324.2822 1338.8045 1342.8513 1357.9137 1366.7246 1378.3362 1384.2286 1393.5141 1420.9630 1429.1522 1432.1152 1443.8344 1457.6656 1461.6058 1462.2264 1464.5820 1465.1803 1471.3573 1475.2430 1476.2403 1479.3339 1481.4367 1485.8181 1490.5538 1496.9751 1547.3149 1578.6646 1631.5341 2815.8950 2844.6085 2861.3927 2951.5849 2959.9547 2968.3003 2969.3344 2975.7615 2978.4939 2995.2685 3005.7346 3010.3877 3019.8538 3019.9993 3029.2808 3034.2323 3040.0115 3059.0541 3071.8874 3076.7571 3079.1939 3091.7409 3149.7020 3170.5012 3180.0028
redmass: 15.6368 4.7643 2.6242 4.8338 4.0923 3.0741 3.2168 3.2737 2.9059 4.0782 4.4586 2.4361 3.7414 4.3453 3.1299 4.2734 4.6822 1.2206 1.3156 3.3271 3.3155 4.1953 3.7827 3.2174 2.2999 2.7123 4.2540 5.7085 3.5768 4.4079 2.7943 3.0838 5.0456 2.7180 2.9238 5.9769 3.5866 4.6156 4.3436 6.0442 6.8387 5.6024 4.6319 6.9632 7.7577 3.4007 3.0832 1.1279 2.8818 3.4495 1.7153 2.0978 2.1062 2.4265 1.3211 3.2048 3.8734 1.6161 5.2961 1.9255 2.3269 1.3581 7.0177 3.5293 2.4016 3.8522 3.8045 1.8359 2.4372 2.4209 1.9374 2.6926 1.3695 1.5402 2.1004 2.1844 1.4183 1.4758 1.5869 1.4336 1.4855 1.9621 1.4002 1.7854 1.6886 1.3513 2.0023 1.3311 1.2763 1.3642 3.0417 1.3519 2.0697 1.5290 1.5617 1.5465 1.6801 1.4499 1.9581 1.7121 1.9618 2.4160 1.1453 4.2384 7.4594 1.1602 1.1573 1.0622 1.0875 1.0761 1.0824 1.0945 1.0722 1.0772 1.0652 1.0952 1.1146 1.5025 1.7116 8.6055 8.7043 6.9726 1.0704 1.0576 1.0574 1.0556 1.0618 1.0670 1.0637 1.0649 1.0617 1.0850 1.1058 1.0616 1.0803 1.0874 1.1022 1.0718 1.1026 1.0939 1.0939 1.1041 1.1016 1.1000 1.0874 1.0975 1.0929
irintensity: 0.0656 0.3342 1.0572 0.1914 0.3610 0.7059 0.7167 0.8785 0.4738 0.4319 0.6599 1.7127 0.3455 0.9992 0.5056 0.6375 1.8788 1.3406 0.0343 2.1265 4.5935 1.4218 3.9700 4.3509 7.0260 1.7863 1.8134 2.5444 4.8429 1.6602 2.1697 1.2845 5.3844 6.5923 3.4752 2.2869 2.2192 7.7908 1.6510 10.7417 10.8392 2.0522 7.7805 4.4743 2.0660 1.5498 1.1345 1.6485 8.4556 13.5209 7.9437 23.8509 30.4169 6.7935 7.5560 51.7148 24.0214 80.6366 73.1139 16.8280 18.0406 6.0028 173.6208 61.5680 17.7129 218.4311 127.3011 11.9215 46.4798 1.2256 4.2732 28.9918 5.0141 5.8281 5.7657 6.9007 8.1364 6.6334 17.0421 5.2891 40.7656 96.8445 56.0696 6.1297 59.2875 16.2878 3.0821 1.0535 1.0679 9.4286 205.9448 11.7430 78.6098 1.6250 23.7037 10.5656 25.1389 0.7197 8.0879 11.6967 23.2876 9.3710 2.2837 43.1717 16.5229 4.3146 7.6842 11.1851 1.7690 7.1576 11.9590 13.6081 6.2027 11.1705 5.5297 31.6497 6.1203 48.1697 15.5602 19.1256 52.1962 6.7912 74.9585 68.4729 208.4286 29.4174 36.6134 23.7319 22.3822 24.7279 30.8860 18.9884 22.0006 27.4423 8.4360 110.6323 28.8772 43.3693 91.0618 20.2411 14.4484 21.9473 47.9262 44.2662 0.5776 6.4187 1.2253
temp: 298.150 k
press: 1.00000 atm
elementType: 9 9 9 8 7 7 6 6 6 6 6 6 6 6 6 6 6 6 6 6 6 6 6 6 6 6 1 1 1 1 1 1 1 1 1 1 1 1 1 1 1 1 1 1 1 1 1 1 1 1 1
symmnumber: 1
zpe: 1087264.7 jmol-1
zpe.correction: 0.414117 hartree
zpe.thermalcorrener: 0.439627 hartree
zpe.thermalcorrenthalpy: 0.440571 hartree
zpe.thermalcorrgfe: 0.354005 hartree
zpe.sumelectzpe: -1259.418832 hartree
zpe.sumelectthermal: -1259.393322 hartree
zpe.sumelectthermalent: -1259.392378 hartree
zpe.sumelectthermalfe: -1259.478945 hartree
dipole: 6.6339 1.7018 0.9986
dipole: 6.9211
quadrupole: -173.7567 -141.9699 -157.3210
quadrupole: -12.5687 6.9613 0.7920
quadrupole: -16.0742 15.7127 0.3615 -12.5687 6.9613 0.7920
hfenergy: -1259.8329491 hartree
pointgroup: C01 [X(C20H25F3N2O1)]
dipole: -2.6351237 0.58403 -0.3600732 debye
polarizability: 291.4378506|-27.6131922|296.0264462|-10.404681|-7.0553905|153.6335657 unknown
InChI: InChI=1S/C20H25F3N2O/c1-25(2)11-6-12-26-19-15-7-4-3-5-8-17(15)24-18-13-14(20(21,22)23)9-10-16(18)19/h9-10,13H,3-8,11-12H2,1-2H3
charge 0 multiplicity 1
51 atoms
F  4.57165 -3.045812 -1.447941
F  5.735669 -1.221062 -0.764185
F  5.151256 -2.829419 0.726915
O  -1.461418 -0.189759 1.03047
N  2.002522 2.040292 -0.05811
N  -5.6703 -2.533125 -0.103401
C  -2.265484 3.47288 -0.355449
C  -1.666936 2.714882 0.867051
C  -1.574452 4.819081 -0.675256
C  -0.382044 1.963804 0.574578
C  -0.077341 4.72713 -1.052489
C  0.846099 4.177168 0.073797
C  0.833905 2.664898 0.206891
C  -0.325634 0.563601 0.652443
C  0.903595 -0.138514 0.40278
C  2.05254 0.657552 0.041336
C  -2.333259 -0.607391 -0.10472
C  1.034753 -1.559406 0.511289
C  3.295938 0.006021 -0.224118
C  -3.483167 -1.425382 0.48332
C  3.390783 -1.383241 -0.124035
C  -4.402189 -1.976911 -0.629219
C  2.256758 -2.176449 0.251285
C  4.686044 -2.088323 -0.397878
C  -5.476298 -3.71922 0.7565
C  -6.639606 -2.798701 -1.187288
H  -2.406052 1.993298 1.256521
H  -1.488427 3.450203 1.678383
H  -2.236214 2.814152 -1.247304
H  -3.334751 3.672418 -0.144959
H  -2.121644 5.312502 -1.503451
H  -1.676773 5.486626 0.206339
H  0.275995 5.743527 -1.314084
H  0.049316 4.107979 -1.96266
H  0.550087 4.646619 1.035212
H  1.891665 4.465007 -0.127129
H  -2.707461 0.29755 -0.626752
H  -1.73039 -1.202585 -0.822416
H  0.16602 -2.146516 0.823798
H  -4.083456 -0.790382 1.159901
H  -3.054568 -2.244763 1.088781
H  4.152368 0.626947 -0.499173
H  -3.836327 -2.734802 -1.236624
H  -4.66854 -1.150518 -1.318541
H  2.360961 -3.262514 0.338482
H  -4.865962 -3.461834 1.638184
H  -6.458027 -4.06981 1.120956
H  -4.980084 -4.571462 0.223778
H  -6.824716 -1.87071 -1.75749
H  -6.29918 -3.586224 -1.907827
H  -7.599626 -3.129006 -0.752292
