program: Gaussian 09
title: 000029147
version: EM64L-G09RevD.01
frameworkgroup: C1[X(C7H8N2O2)]
method: RPBEPBE
basis: SDD
operation: Freq
keyword: #pfreq=noraman
keyword: PBEPBE/SDD
title: #p freq=noraman PBEPBE/SDD
converged: NO YES NO NO
title: Mulliken charges:
elementType: O O N N C C C C C C C H H H H H H H H
charge: -0.212558 -0.212559 -0.532807 0.024844 0.439461 -0.553771 -0.340567 -0.340590 0.370881 -0.352855 -0.352851 0.226731 0.226734 0.242329 0.242331 0.285899 0.285899 0.276724 0.276725
chargesum: 0.00000
title: Mulliken charges with hydrogens summed into heavy atoms:
elementType: O O N N C C C C C C C
charge: -0.212558 -0.212559 0.020641 0.024844 0.439461 -0.100306 -0.098238 -0.098259 0.370881 -0.066957 -0.066951
polarizability: 1.72237496e+02 4.74617671e-04 1.02516221e+02 9.09672802e-02 8.53035698e-04 4.99570189e+01
1716.lowfreq: -9.0932 -4.1463 -0.0011 -0.0011 -0.0009 6.4763 25.7411 67.5510 75.6223
frequency: 25.3636 67.5485 75.6069 189.6321 189.7203 249.4413 318.2913 357.6003 384.4668 406.6240 506.7280 511.3683 587.9358 626.8230 636.0869 671.2650 730.0298 765.3424 811.8585 848.6681 866.3332 870.0980 984.6576 991.9795 1003.8068 1061.8425 1086.6775 1092.5889 1133.3832 1178.7377 1199.8705 1220.8648 1296.6033 1326.9174 1329.7780 1362.6207 1403.0362 1419.3619 1455.8757 1477.5618 1594.4963 1603.6359 1648.6815 3006.8393 3067.3073 3129.3614 3131.8171 3181.4111 3183.4943 3455.7140 3583.7507
redmass: 2.5418 7.6219 5.9154 5.2013 2.5233 1.7653 6.5908 1.9693 4.9769 2.8535 6.9376 3.2439 2.1130 6.8711 2.5585 4.4165 5.3138 5.6190 4.8914 1.2435 1.2639 1.8581 1.3373 1.3724 3.1065 4.5028 1.3119 3.3910 1.1678 1.3608 3.2550 5.8763 1.3021 1.3017 1.2200 6.7618 8.0420 3.2094 1.1545 2.1104 7.6084 6.2666 1.0861 1.0602 1.1048 1.0903 1.0907 1.0940 1.0951 1.0450 1.0980
irintensity: 1.0232 0.0941 2.3083 0.8961 24.8756 23.8829 0.6723 13.7175 1.7456 0.4548 1.3956 17.6038 181.8800 0.4398 226.8353 33.8621 15.5309 76.9080 7.3865 0.0093 0.1213 58.4184 2.9323 0.0092 0.5565 29.1407 10.1313 13.4240 8.3605 95.9356 6.7876 325.0374 0.0141 1.2648 0.3041 96.1329 0.1395 46.6851 9.4976 1.6516 1.6200 64.5518 33.9557 50.4153 17.8624 15.7312 5.4807 0.0473 3.1120 15.2221 1.8782
temp: 298.150 k
press: 1.00000 atm
elementType: 8 8 7 7 6 6 6 6 6 6 6 1 1 1 1 1 1 1 1
symmnumber: 1
zpe: 378674.9 jmol-1
zpe.correction: 0.144230 hartree
zpe.thermalcorrener: 0.154358 hartree
zpe.thermalcorrenthalpy: 0.155302 hartree
zpe.thermalcorrgfe: 0.107218 hartree
zpe.sumelectzpe: -530.597680 hartree
zpe.sumelectthermal: -530.587552 hartree
zpe.sumelectthermalent: -530.586607 hartree
zpe.sumelectthermalfe: -530.634692 hartree
dipole: -4.8137 0.0000 0.0385
dipole: 4.8139
quadrupole: -86.7041 -58.1978 -62.7900
quadrupole: 0.0007 -1.9714 0.0000
quadrupole: -17.4734 11.0329 6.4406 0.0007 -1.9714 0.0000
hfenergy: -530.7419095 hartree
pointgroup: C01 [X(C7H8N2O2)]
dipole: -1.8935723 0.0000219 -0.0365539 debye
dipolederiv: -0.7986183 -0.2045289 0.0294082 -0.3577186 -0.6735593 -0.0039038 0.0603683 0.0214817 -0.2370424 -0.798639 0.2045247 0.0294317 0.3577091 -0.6735453 0.0038522 0.0604093 -0.021531 -0.2370454 -1.3688336 0.0000117 -0.1526643 0.0000049 -0.1630447 0.0000487 -0.0886383 0.0000461 -0.4374902 2.0555676 0.000014 -0.087967 0.0000302 1.0886663 0.0000537 -0.1996773 0.0000498 0.1999926 0.455814 -0.0000074 0.0087388 -0.0000523 0.0472972 0.0000126 0.2135085 0.0000095 -0.0893894 0.5762444 0.0000052 0.0457785 0.0000627 0.2017394 -0.0000421 -0.3613411 -0.0000327 0.3807144 -0.3993844 -0.1491812 -0.0383411 -0.3111097 0.0585252 0.0031774 0.0665329 0.0178479 -0.1396455 -0.3994001 0.1491845 -0.0383259 0.3110974 0.0585352 -0.0031601 0.0665587 -0.0178289 -0.1396402 -0.9164227 -0.0000096 0.0054064 -0.0000254 0.0065243 0.0000013 0.1190874 -0.0000019 0.0432102 0.2916358 0.0895059 0.0048734 -0.2201101 -0.0226778 0.0097011 -0.0300841 -0.0082358 -0.0876908 0.2916365 -0.0895066 0.0048593 0.2201157 -0.0226786 -0.0096979 -0.0300504 0.0082423 -0.087685 0.0117354 -0.0190089 0.0022523 -0.0952354 -0.0620757 0.1336521 0.019237 0.0692451 0.0065838 0.0117211 0.0190129 0.0022681 0.0952269 -0.0620022 -0.1336701 0.0192607 -0.0692615 0.0065234 0.0218664 0.0948221 0.0187926 0.074228 -0.0361994 -0.0102214 0.0128931 -0.0101988 0.1389738 0.0218704 -0.0948214 0.0187839 -0.0742239 -0.0362046 0.0102056 0.0128831 0.0101855 0.1389774 0.0903347 -0.0652147 0.0043651 -0.0245283 0.0567529 0.0012651 -0.0144052 0.0051204 0.165367 0.0903319 0.0652165 0.0043712 0.024532 0.0567585 -0.0012757 -0.0144024 -0.0051316 0.1653658 0.3812557 0.1467582 0.0690104 0.1315977 0.0886192 -0.0469796 0.0439545 -0.0459598 0.1049423 0.3812842 -0.146777 0.0689583 -0.1316008 0.0885693 0.0469809 0.0439053 0.0459538 0.104978 unknown
polarizability: 172.2239411|-0.0006127|102.5162209|1.2905569|0.0022902|49.9705735 unknown
InChI: InChI=1S/C7H8N2O2/c8-5-6-1-3-7(4-2-6)9(10)11/h1-4H,5,8H2
charge 0 multiplicity 1
19 atoms
O  3.201211 1.140923 -0.173416
O  3.201241 -1.14087 -0.173549
N  -3.871104 0.000137 -0.938116
N  2.596126 0.000016 -0.11212
C  -1.681905 -0.000075 0.31593
C  -3.210687 -0.00009 0.388821
C  -0.959878 1.222453 0.249015
C  -0.959839 -1.22257 0.248899
C  1.12192 -0.000014 0.034502
C  0.440447 1.235601 0.107344
C  0.440488 -1.235655 0.107222
H  -3.564401 -0.888219 0.94271
H  -3.564405 0.887845 0.943017
H  -1.503489 2.17255 0.31686
H  -1.503418 -2.172691 0.316655
H  1.012789 2.165729 0.060233
H  1.012865 -2.165757 0.060014
H  -3.705906 -0.847884 -1.489915
H  -3.705957 0.848371 -1.489604
