program: Gaussian 09
title: 000029145
version: EM64L-G09RevD.01
frameworkgroup: C1[X(C4H9NO2S)]
method: RPBEPBE
basis: SDD
operation: Freq
keyword: #p
keyword: freq=noraman
keyword: PBEPBE/SDD
title: #p freq=noraman PBEPBE/SDD
converged: YES YES NO NO
title: Mulliken charges:
elementType: S O O N C C C C H H H H H H H H H
charge: -0.009105 -0.265901 -0.236713 -0.593912 -0.120057 -0.731341 0.226307 -0.502617 0.251136 0.277840 0.283162 0.287865 0.303963 0.102533 0.247733 0.243038 0.236069
chargesum: 0.00000
title: Mulliken charges with hydrogens summed into heavy atoms:
elementType: S O O N C C C C
charge: 0.093428 -0.265901 -0.236713 -0.002084 0.131079 -0.170340 0.226307 0.224223
polarizability: 9.63894765e+01 7.86767356e-01 6.77857495e+01 -4.21310591e+00 6.47307120e+00 5.61920672e+01
1716.lowfreq: -12.5454 -5.8074 -0.0036 -0.0023 -0.0010 6.9444 47.0571 93.5935 94.7347
frequency: 46.8082 93.5643 94.6070 108.9476 201.9337 208.9774 221.8637 258.4214 313.3454 330.6489 368.3865 495.9842 568.8008 616.8560 643.6014 742.0014 782.0922 819.5676 885.3165 948.3612 1014.2356 1113.9278 1114.5927 1142.4885 1149.6252 1163.3585 1231.7608 1252.7124 1314.6636 1362.4752 1423.6131 1428.5820 1453.0378 1464.2663 1600.8526 1653.3122 2427.1141 2988.2518 3007.5367 3030.6913 3110.7502 3114.7428 3153.7306 3470.3557 3608.2446
redmass: 4.8765 1.2974 2.4292 3.1373 3.7250 2.5618 1.3718 5.4385 1.4837 2.5611 2.6567 2.5462 1.3774 5.8758 4.4457 3.5991 1.4890 3.2503 2.6349 4.6248 2.4628 1.2787 2.0701 1.5417 1.4825 1.6963 1.7591 1.2370 1.2116 1.5501 1.1942 1.0909 1.0498 1.0507 1.4114 3.2076 1.0382 1.0841 1.0295 1.0568 1.1048 1.1086 1.1051 1.0440 1.1001
irintensity: 0.4215 0.4126 0.8015 1.6879 10.6680 0.9091 28.6576 1.7844 50.8421 5.1369 3.5305 3.8042 330.5063 16.7808 20.9502 4.5811 1.1068 13.9480 11.3166 4.8573 7.8187 3.5842 117.7912 99.1877 2.3298 111.1873 12.6158 14.2366 18.6618 16.8074 20.6017 8.1977 15.0065 12.1307 189.7110 86.1557 25.1094 27.7847 29.6966 15.7938 24.4181 11.4458 14.0398 3.5771 23.4872
temp: 298.150 k
press: 1.00000 atm
elementType: 16 8 8 7 6 6 6 6 1 1 1 1 1 1 1 1 1
symmnumber: 1
zpe: 344195.6 jmol-1
zpe.correction: 0.131097 hartree
zpe.thermalcorrener: 0.141486 hartree
zpe.thermalcorrenthalpy: 0.142430 hartree
zpe.thermalcorrgfe: 0.094704 hartree
zpe.sumelectzpe: -760.412456 hartree
zpe.sumelectthermal: -760.402067 hartree
zpe.sumelectthermalent: -760.401123 hartree
zpe.sumelectthermalfe: -760.448849 hartree
dipole: -1.2369 -2.3559 -0.1324
dipole: 2.6641
quadrupole: -52.9025 -57.8577 -56.4102
quadrupole: 6.5452 -1.6846 2.1778
quadrupole: 2.8210 -2.1342 -0.6867 6.5452 -1.6846 2.1778
hfenergy: -760.5435536 hartree
pointgroup: C01 [X(C4H9N1O2S1)]
dipole: -0.5517519 0.884359 0.1100034 debye
dipolederiv: -0.2781349 -0.1123981 -0.0666789 -0.1369722 -0.2119982 0.1251629 -0.141321 0.146601 0.0312587 -1.0839909 0.3776024 0.067399 0.5634043 -0.773673 -0.2029583 0.1304125 -0.2134805 -0.3875824 -0.6699981 -0.186427 -0.1551751 0.1035058 -0.7394569 -0.2173997 -0.0888929 -0.3735145 -0.4941195 -0.4049527 0.0552333 0.1204344 -0.0482567 -0.8059303 0.194519 0.1086529 0.3059329 -0.5683094 -0.294286 -0.213283 -0.1374427 -0.1482155 0.5505635 -0.1016275 -0.1591419 -0.0064481 0.2690143 0.4072607 0.0616952 0.0358193 0.2455972 -0.0139776 0.0620717 0.0735285 0.0535155 0.0460589 1.3307101 -0.0744134 0.1128102 -0.5846145 1.0931551 0.4782457 0.0681633 0.6435601 0.5265534 0.620601 -0.1436269 -0.0124759 -0.0910731 0.2755184 -0.0207234 0.0368951 -0.0533628 0.2532917 0.0688637 0.0113782 -0.0081789 0.0272144 -0.0485625 -0.067884 0.0202302 -0.0896174 -0.0925381 0.0276214 -0.0320328 -0.0208565 -0.0195853 0.0868446 -0.0618807 0.007874 -0.0132029 -0.0647515 -0.0565113 0.0616877 -0.0183047 0.0434658 -0.1084143 0.0194836 -0.0075259 -0.0201264 0.0756084 0.0784035 0.0557662 -0.0277071 0.0018509 0.2915678 -0.0745984 0.0284791 -0.144044 0.3106296 0.2621181 0.0026518 -0.0546689 0.0357729 0.2634281 -0.0391069 -0.0539561 -0.152147 0.1589909 0.0049504 0.0614286 0.1036755 0.0224197 0.109846 -0.0930596 0.0012125 -0.1190676 -0.1025729 -0.0467759 -0.0069027 0.0253357 -0.1114641 -0.0256826 0.0765928 0.0080754 0.0711694 0.0685641 -0.0064788 0.0331427 0.026096 -0.0017094 0.1020686 -0.0018215 -0.0645575 0.0500042 -0.1091288 0.0405997 0.0484976 0.0099185 0.0986597 -0.0452969 -0.0750158 0.0318718 -0.085772 0.0790326 unknown
polarizability: 96.2723135|0.8729827|66.7896828|4.2436752|7.525569|57.3052969 unknown
InChI: InChI=1S/C4H9NO2S/c1-7-4(6)3(5)2-8/h3,8H,2,5H2,1H3
charge 0 multiplicity 1
17 atoms
S  3.273873 0.932762 -0.054857
O  -1.46645 0.809979 0.426506
O  -1.279325 -1.160696 -0.803943
N  1.241636 -1.600108 0.300076
C  0.693934 -0.252209 0.388366
C  1.430407 0.826197 -0.480901
C  -0.76924 -0.290974 -0.062043
C  -2.889677 0.906897 0.012628
H  0.707936 0.111122 1.435079
H  1.412401 0.545654 -1.547625
H  0.981012 1.824036 -0.350216
H  2.26208 -1.642358 0.362332
H  0.821699 -2.178008 -0.433315
H  3.09744 1.477362 1.208778
H  -3.450632 0.033827 0.385109
H  -2.966118 0.945521 -1.086868
H  -3.251377 1.837196 0.471394
