program: Gaussian 09
title: 000029153
version: EM64L-G09RevD.01
frameworkgroup: C1[X(C8H7ClO2S)]
method: RPBEPBE
basis: SDD
operation: Freq
keyword: #p
keyword: freq=noraman
keyword: PBEPBE/SDD
title: #p freq=noraman PBEPBE/SDD
converged: YES YES NO NO
title: Mulliken charges:
elementType: Cl S O O C C C C C C C C H H H H H H H
charge: -0.041537 0.271264 -0.413709 -0.217820 -0.166103 -0.082255 -0.230642 -0.706251 -0.215183 -0.219312 -0.214882 0.248323 0.263758 0.304076 0.297681 0.260525 0.238648 0.239258 0.384162
chargesum: 0.00000
title: Mulliken charges with hydrogens summed into heavy atoms:
elementType: Cl S O O C C C C C C C C
charge: -0.041537 0.271264 -0.029547 -0.217820 -0.166103 -0.082255 0.033116 -0.104495 0.045341 0.019336 0.024376 0.248323
polarizability: 1.61310845e+02 -1.02530630e+01 1.12500588e+02 1.26125434e+01 4.14812389e+00 7.40177921e+01
1716.lowfreq: -7.1272 -0.0027 -0.0012 0.0014 1.0643 5.6929 25.1309 33.3104 57.6050
frequency: 25.0537 33.2792 57.5929 83.7561 139.1138 162.9197 194.5749 243.1238 313.0403 370.0328 406.0190 442.7229 451.0513 499.0009 516.6055 565.8080 629.5901 640.5096 703.8404 710.3224 746.2975 764.0782 866.6973 872.0319 894.6458 953.5464 989.5259 997.3473 1028.0703 1045.6127 1103.2185 1119.5292 1146.0564 1171.5802 1226.4407 1248.8927 1316.6716 1360.4448 1413.2181 1427.5939 1437.2056 1567.6255 1582.3920 1673.0121 3029.3859 3101.9501 3140.1459 3152.6376 3165.5817 3177.2304 3515.4994
redmass: 7.1305 9.2405 4.7739 3.5432 5.6855 10.6278 14.6315 5.7403 7.2672 8.1326 9.0435 4.8224 5.3850 1.8093 4.1482 4.6310 1.3918 6.6541 4.7528 6.4748 3.7665 1.3917 1.8013 2.6112 1.6869 1.3713 1.3376 7.5454 2.9402 2.2142 2.4967 1.6120 1.1724 1.0574 1.3147 1.3909 2.1180 9.7556 2.0633 1.1095 2.2993 6.2472 6.7408 8.7814 1.0583 1.1038 1.0858 1.0906 1.0953 1.1006 1.0641
irintensity: 0.5449 0.5895 1.5114 2.2204 1.2600 0.9871 1.6309 1.6424 1.1169 11.8294 4.6814 13.7156 4.2884 30.0916 0.5936 46.2472 131.4267 12.6324 4.8839 13.8892 11.3373 101.2480 3.3996 2.8687 9.5379 1.9709 0.1603 30.2112 12.5877 327.7518 11.4321 1.2275 0.8458 0.2006 0.6537 3.0581 63.3307 1.4148 20.2731 41.1188 49.7757 7.5923 0.7446 208.6304 26.5735 1.3050 1.2201 6.4190 8.7605 13.9865 26.3732
temp: 298.150 k
press: 1.00000 atm
elementType: 17 16 8 8 6 6 6 6 6 6 6 6 1 1 1 1 1 1 1
symmnumber: 1
zpe: 343460.6 jmol-1
zpe.correction: 0.130817 hartree
zpe.thermalcorrener: 0.142753 hartree
zpe.thermalcorrenthalpy: 0.143697 hartree
zpe.thermalcorrgfe: 0.089923 hartree
zpe.sumelectzpe: -1316.740890 hartree
zpe.sumelectthermal: -1316.728955 hartree
zpe.sumelectthermalent: -1316.728010 hartree
zpe.sumelectthermalfe: -1316.781784 hartree
dipole: 1.9535 -0.5880 3.0548
dipole: 3.6734
quadrupole: -67.5759 -80.6966 -89.7846
quadrupole: -4.9421 -4.7192 -1.5416
quadrupole: 11.7764 -1.3442 -10.4322 -4.9421 -4.7192 -1.5416
hfenergy: -1316.8717072 hartree
pointgroup: C01 [X(C8H7Cl1O2S1)]
dipole: -0.7175229 -0.7426968 -1.01107 debye
dipolederiv: -0.2224185 -0.2140692 0.037245 -0.1749625 -0.6207298 0.1177769 0.0455618 0.1418587 -0.0877618 0.0087555 -0.0298321 0.0401529 -0.1037236 -0.084094 -0.0070199 0.1024484 0.0119445 0.1370938 -0.817654 0.0202652 0.5482823 0.0435083 -0.4204309 -0.0228722 0.5672854 -0.0170921 -0.9324148 -0.8020301 -0.0498973 -0.2340536 -0.0235409 -0.2965586 -0.0545569 0.0420971 -0.0481392 -0.8551662 0.436567 -0.0281937 0.1426313 0.0834729 -0.1993298 0.0839689 0.0888384 0.0301147 -0.1367181 0.0842237 0.4117787 -0.0793145 0.1760089 0.8568091 -0.2289762 -0.0924007 -0.2061673 0.0027407 -0.1849688 -0.0282141 0.021318 -0.0007768 0.0066288 -0.0544987 0.0346274 -0.053605 -0.0618731 -0.3721828 -0.01176 -0.1926267 0.1199808 0.1066591 -0.0054995 -0.52201 -0.0132416 0.0247002 -0.1260394 -0.1499294 0.0574479 -0.0794238 -0.1914745 -0.0076079 0.0256158 -0.0243859 -0.0752994 -0.0666879 0.1046355 -0.0061898 0.0627072 0.0447128 -0.0608785 0.0296997 -0.0372593 -0.1192041 0.057508 0.005897 0.0942329 0.0505597 0.0211746 -0.0464771 0.0563981 -0.0689066 -0.0892312 1.6049133 0.0502172 -0.2180711 0.0091381 0.2210482 0.0962435 -0.1881811 0.1015225 1.4443449 0.0725801 0.0493023 -0.0582487 0.0401635 0.0253472 0.0539499 -0.0549684 0.0664025 0.101886 0.1258555 0.0064479 0.0236612 -0.0587228 0.0434828 0.067013 0.0510522 0.0493225 0.0096895 0.0401486 -0.0179458 0.0378145 -0.0263092 0.0277252 -0.0629564 0.0988853 -0.061989 -0.0109006 0.0558729 0.0292724 -0.0507467 0.0461755 0.0326833 0.0732656 -0.0565483 0.0714788 0.1136528 0.0403031 -0.0827193 -0.0078296 -0.1007589 -0.0491746 0.0566958 -0.0120789 0.0579919 0.1368981 -0.0771586 -0.0453269 -0.0730345 -0.0430375 0.0841738 0.0161633 -0.0814635 0.0163516 0.1240281 0.1424123 -0.0199283 -0.0826707 -0.0204591 0.3913471 -0.0137336 -0.1348587 -0.0162018 0.273535 unknown
polarizability: 158.885284|18.5072714|105.9533396|8.5916821|-16.2521642|82.9906007 unknown
InChI: InChI=1S/C8H7ClO2S/c9-6-3-1-2-4-7(6)12-5-8(10)11/h1-4,10H,5H2
charge 0 multiplicity 1
19 atoms
Cl -0.756713 2.234944 -0.546292
S  0.925495 -0.135527 1.189182
O  4.076139 -0.021361 -1.366348
O  3.920014 0.156919 0.948452
C  -0.766002 -0.386627 0.505558
C  -1.49608 0.602662 -0.195977
C  -1.411831 -1.622218 0.769639
C  1.8765 -0.020618 -0.44526
C  -2.814852 0.38129 -0.640962
C  -2.738949 -1.856663 0.347223
C  -3.439046 -0.855832 -0.363833
C  3.36155 0.047106 -0.160997
H  -0.854625 -2.394212 1.309748
H  1.562839 0.887721 -0.987737
H  1.651571 -0.900052 -1.06947
H  -3.344142 1.168687 -1.185316
H  -3.217326 -2.816604 0.566599
H  -4.465916 -1.028884 -0.702232
H  5.051174 0.043972 -1.174576
