program: Gaussian 09
title: 000029210
version: EM64L-G09RevD.01
frameworkgroup: C1[X(C15H24N2O3)]
method: RPBEPBE
basis: SDD
operation: Freq
keyword: #p
keyword: freq=noraman
keyword: PBEPBE/SDD
title: #p freq=noraman PBEPBE/SDD
converged: YES YES NO NO
title: Mulliken charges:
elementType: O O O N N C C C C C C C C C C C C C C C H H H H H H H H H H H H H H H H H H H H H H H H
charge: -0.313175 -0.224629 -0.237231 -0.108081 -0.693998 -0.384380 -0.323991 -0.327144 -0.254706 -0.670822 -0.671186 0.085811 0.184184 0.248909 -0.284647 -0.585680 0.550776 -0.450522 -0.246885 -0.679332 0.207687 0.214365 0.186382 0.203844 0.187796 0.210507 0.221525 0.233871 0.210145 0.228712 0.204131 0.205849 0.230587 0.205339 0.273120 0.237653 0.220046 0.204775 0.205246 0.239911 0.237821 0.198221 0.307521 0.311678
chargesum: 0.00000
title: Mulliken charges with hydrogens summed into heavy atoms:
elementType: O O O N N C C C C C C C C C C C C C C C
charge: -0.313175 -0.224629 -0.237231 -0.108081 -0.074800 0.037672 0.066235 0.071159 0.200689 -0.027835 -0.029411 0.085811 0.184184 0.248909 -0.011527 -0.348027 0.550776 -0.230476 0.163136 -0.003379
polarizability: 2.70461654e+02 -1.80280850e+01 2.19691404e+02 -5.72197862e+00 5.93558844e+00 1.25946458e+02
1716.lowfreq: -8.9365 -0.7788 -0.0007 0.0003 0.0008 2.4655 5.5619 22.6061 33.6545
frequency: -4.5115 22.5162 33.6189 34.6324 65.2696 67.8431 71.7753 88.0416 89.8902 109.0054 114.6982 140.9908 170.0282 185.9150 212.4292 218.6150 223.1221 238.0332 279.1667 285.3475 297.3338 302.8788 316.3330 348.0522 363.8680 393.5925 396.8931 398.6119 419.9483 456.3117 458.2791 487.6499 563.5637 572.3728 617.2425 631.5759 674.7070 724.0532 734.6247 750.1255 779.1772 788.1084 796.1472 809.3793 811.5021 825.0431 846.9493 866.8988 910.6862 922.3720 970.5738 973.1358 988.8284 1010.9321 1026.6468 1055.3034 1060.9100 1063.4164 1075.7884 1084.9456 1093.9873 1115.4945 1122.7456 1131.1540 1142.4847 1162.0993 1189.1981 1208.0130 1224.4527 1228.3688 1260.9427 1270.2773 1273.4293 1285.0303 1290.5740 1321.7808 1331.3786 1362.1046 1362.2267 1366.6469 1382.8982 1386.3972 1387.3446 1396.8340 1405.7427 1439.6237 1457.7721 1460.6166 1462.8862 1469.3140 1472.8439 1475.3170 1480.5942 1485.1809 1487.1747 1487.4619 1492.1321 1513.4239 1568.5683 1624.1367 1630.6492 1645.0375 2849.1336 2858.5363 2901.7222 2948.2418 2981.6796 2983.3822 2998.6875 3008.0454 3012.6158 3025.0032 3034.4937 3046.2560 3073.5173 3075.3514 3082.6770 3091.6958 3093.4992 3095.8785 3111.7366 3133.4301 3152.5086 3182.3983 3564.1380 3704.4759
redmass: 3.4087 4.2848 6.9211 3.6962 3.1185 2.8455 4.1854 2.2428 3.0158 2.9469 1.8110 2.8773 2.0928 2.0542 2.2972 4.0453 1.3531 1.2746 2.5067 2.5454 2.9541 4.2376 3.0803 4.4923 3.8246 1.1065 3.1594 1.2522 3.3238 2.7824 2.7864 2.9478 5.0922 5.5799 6.2849 5.7449 2.8966 5.4792 3.3312 2.4511 1.9461 1.2563 1.1634 1.6841 1.6607 1.3647 1.6897 3.3665 2.4322 3.7837 1.3593 2.6666 2.3169 7.4371 2.5699 1.5960 2.4877 1.7976 1.9078 2.1858 2.7918 2.1976 1.6970 1.4264 1.6318 1.3721 2.2639 2.2770 2.4662 1.9770 1.1492 1.5117 1.1258 1.2242 1.2434 1.3827 2.2145 1.5281 1.3459 1.3548 1.4649 1.2384 1.2441 1.6129 2.8190 3.3785 1.0392 1.0566 1.0518 1.0614 1.0652 1.0870 1.0536 1.0701 1.0729 1.1033 1.0763 3.2559 7.7725 7.2770 5.0936 1.3040 1.0721 1.0714 1.0702 1.0549 1.0357 1.0357 1.0366 1.1075 1.0574 1.0875 1.0871 1.0902 1.0989 1.0980 1.1070 1.1003 1.1003 1.0987 1.1012 1.0902 1.0900 1.0940 1.0449 1.1040
irintensity: 0.4306 1.9026 1.3583 1.3265 0.4048 0.8752 1.6557 0.7084 2.0667 0.2329 0.5266 0.4284 0.9244 1.7639 1.3277 2.1412 0.3073 0.0150 8.5808 1.9164 0.6588 13.4088 4.1752 1.4924 3.5595 104.8831 22.6211 164.5009 10.4298 18.2235 0.2664 1.8880 7.8426 11.4850 6.2083 0.1952 24.5906 1.8880 14.1467 2.4879 8.0299 2.1971 3.2893 16.9452 6.2098 53.7315 34.5539 7.2277 5.7977 8.3042 0.2700 35.0250 13.8227 505.0550 68.7531 74.9332 58.0738 41.1129 18.0545 2.7880 4.1787 4.2139 7.9043 4.7724 170.7786 6.9496 114.4997 69.7822 224.1083 137.2068 0.1554 38.4643 3.5507 1.3313 26.6725 14.9483 98.4304 12.0149 3.2937 7.3541 4.9024 22.0391 19.0021 37.1280 19.5346 40.6525 11.5807 2.2132 7.5551 1.0823 5.6282 17.3795 6.2900 10.0065 14.1101 12.4759 10.4115 45.8299 129.4904 186.1429 477.8624 261.7925 37.2729 166.2284 88.1864 44.3221 33.5829 33.5477 26.2008 39.0599 30.6188 12.6666 19.5843 12.6624 33.5228 84.4093 49.9215 35.4092 45.4726 27.9325 28.9885 17.2289 15.4666 4.3334 101.0180 21.3684
temp: 298.150 k
press: 1.00000 atm
elementType: 8 8 8 7 7 6 6 6 6 6 6 6 6 6 6 6 6 6 6 6 1 1 1 1 1 1 1 1 1 1 1 1 1 1 1 1 1 1 1 1 1 1 1 1
symmnumber: 1
zpe: 972499.0 jmol-1
zpe.correction: 0.370405 hartree
zpe.thermalcorrener: 0.392490 hartree
zpe.thermalcorrenthalpy: 0.393435 hartree
zpe.thermalcorrgfe: 0.317721 hartree
zpe.sumelectzpe: -919.593341 hartree
zpe.sumelectthermal: -919.571256 hartree
zpe.sumelectthermalent: -919.570312 hartree
zpe.sumelectthermalfe: -919.646026 hartree
dipole: 4.0540 -3.3446 -1.2054
dipole: 5.3920
quadrupole: -73.3795 -110.5637 -123.9906
quadrupole: -4.7340 0.4855 -0.1440
quadrupole: 29.2651 -7.9191 -21.3460 -4.7340 0.4855 -0.1440
hfenergy: -919.9637463 hartree
pointgroup: C01 [X(C15H24N2O3)]
dipole: -1.7263298 1.1836034 -0.3452266 debye
polarizability: 273.5314647|-13.4088747|217.125196|-1.1107652|-0.8692986|125.4428549 unknown
InChI: InChI=1S/C15H24N2O3/c1-4-17(5-2)9-10-20-15(18)13-8-7-12(16)11-14(13)19-6-3/h7-8,11H,4-6,9-10,16H2,1-3H3
charge 0 multiplicity 1
44 atoms
O  0.884642 0.417815 0.233238
O  -2.697449 -1.905528 0.454495
O  0.044555 -1.733476 0.540239
N  4.614358 0.442295 -0.079933
N  -5.191925 2.297244 0.13605
C  3.22135 0.955141 -0.067119
C  5.616588 1.434389 0.388997
C  4.979229 -0.197559 -1.373338
C  2.246957 -0.165109 0.319232
C  5.586741 1.639093 1.915799
C  6.075841 -1.269668 -1.225471
C  -1.491136 0.182983 0.30736
C  -0.18433 -0.510169 0.377049
C  -2.745512 -0.517939 0.355413
C  -1.542361 1.601333 0.195365
C  -3.96768 0.19181 0.2971
C  -3.983559 1.609109 0.189688
C  -2.745294 2.313979 0.13781
C  -3.965279 -2.662558 0.500865
C  -3.578934 -4.135301 0.60751
H  2.916546 1.385882 -1.050349
H  3.136378 1.76755 0.67595
H  5.490846 2.420128 -0.128131
H  6.617278 1.059641 0.106348
H  5.293775 0.566298 -2.129615
H  4.070134 -0.679092 -1.779094
H  2.315953 -1.035453 -0.358208
H  2.435889 -0.518874 1.348153
H  4.609777 2.024169 2.260675
H  5.773464 0.680171 2.429656
H  6.361126 2.366294 2.224716
H  7.01891 -0.844039 -0.837045
H  5.744134 -2.055401 -0.524933
H  6.296812 -1.734895 -2.204499
H  -0.590566 2.13636 0.156946
H  -4.919646 -0.346317 0.333002
H  -2.738672 3.406673 0.055014
H  -4.550464 -2.463112 -0.421057
H  -4.560443 -2.335857 1.378992
H  -2.978285 -4.311157 1.515425
H  -2.976676 -4.440674 -0.264369
H  -4.486287 -4.765287 0.652389
H  -6.079677 1.805225 0.176373
H  -5.206609 3.310182 0.060911
