program: Gaussian 09
title: 000029212
version: EM64L-G09RevD.01
frameworkgroup: C1[X(C20H26O3)]
method: RPBEPBE
basis: SDD
operation: Freq
keyword: #pfreq=noraman
keyword: PBEPBE/SDD
title: #p freq=noraman PBEPBE/SDD
converged: YES YES NO NO
title: Mulliken charges:
elementType: O O O C C C C C C C C C C C C C C C C C C C C H H H H H H H H H H H H H H H H H H H H H H H H H H
charge: -0.420962 -0.211581 -0.231342 0.237207 -0.166894 0.258251 -0.470558 -0.494181 -0.437998 -0.620418 0.368762 -0.816287 -0.791372 0.071334 -0.031567 0.106722 -0.392356 -0.569825 0.591249 -0.508005 -0.243787 -0.692937 -0.694145 0.273850 0.229662 0.199278 0.212025 0.231407 0.206131 0.224600 0.256849 0.250830 0.220519 0.231216 0.235558 0.238284 0.234046 0.248250 0.246726 0.284385 0.235686 0.377837 0.206873 0.221970 0.212225 0.224864 0.223731 0.212795 0.221093
chargesum: 0.00000
title: Mulliken charges with hydrogens summed into heavy atoms:
elementType: O O O C C C C C C C C C C C C C C C C C C C C
charge: -0.043125 -0.211581 -0.231342 0.237207 0.106956 0.258251 -0.041618 -0.050748 -0.007267 -0.112739 0.368762 -0.128993 -0.070791 0.071334 -0.031567 0.106722 -0.145630 -0.285440 0.591249 -0.272320 -0.036914 -0.033878 -0.036527
polarizability: 2.86989084e+02 1.72602658e+00 2.12938950e+02 -1.04187150e+01 -2.51631147e+00 1.62096118e+02
1716.lowfreq: -9.5881 -7.8644 -0.0005 -0.0005 0.0008 3.4008 25.1251 26.4670 37.4658
frequency: 25.0629 26.3443 37.1242 54.5787 87.9047 99.7082 115.8176 128.3857 152.9468 181.7486 189.8250 208.9387 214.5758 223.6696 239.8054 242.8228 261.2247 275.2227 283.8795 291.3137 318.7957 326.3700 332.8337 340.0062 360.9432 384.6147 411.3224 444.2267 447.2244 452.6564 476.7398 498.3332 502.0360 556.0120 562.3224 592.8340 605.0045 613.4609 616.9134 675.2539 687.0484 695.5977 718.6630 731.2919 769.8539 794.1386 827.1875 846.4994 849.5759 865.6497 885.3831 903.7908 916.0909 917.7524 920.4218 947.8565 955.2652 966.1050 976.0979 981.9339 1009.4426 1021.7605 1034.3006 1054.7207 1068.0705 1078.8488 1083.4931 1100.2547 1113.3355 1123.1168 1133.1658 1139.2864 1145.3092 1164.4447 1184.7097 1194.0701 1207.9397 1211.4534 1215.4896 1242.7511 1260.1174 1269.6886 1270.7017 1290.2218 1296.0266 1308.3494 1324.5185 1335.2157 1337.9487 1353.1055 1365.4337 1375.5947 1378.9147 1384.2877 1385.6909 1395.4429 1397.0223 1415.1138 1438.0150 1463.6359 1466.5927 1468.3510 1473.1825 1475.6700 1478.3507 1479.4401 1480.6891 1485.5033 1486.3337 1491.5449 1495.6486 1566.2674 1582.1552 1623.7718 1635.6193 2974.2265 2975.8751 2976.9709 2977.2781 2979.4619 2982.8952 2988.9608 2994.3868 2994.6988 3001.9979 3034.8705 3047.0441 3052.5911 3055.1541 3070.4192 3071.8732 3076.2560 3077.0604 3082.0291 3086.8153 3096.0677 3105.2065 3112.6372 3134.9737 3142.4170 3507.7512
redmass: 9.2619 3.9400 4.4077 3.8850 4.4372 3.4381 3.5337 3.8065 3.1008 2.7254 3.8203 1.1350 2.5990 2.1449 1.2060 1.4112 1.5020 2.7718 1.9430 2.1018 2.7415 3.8736 3.5313 2.9820 2.6675 3.7384 3.1578 3.8551 3.3640 3.8368 3.8996 2.8803 4.4548 3.1158 2.9778 2.9385 1.7852 2.4307 2.2559 4.0659 3.6832 3.9681 3.7392 4.4743 3.5148 2.7182 1.7684 2.9565 1.5037 2.0677 2.3848 2.6153 2.1993 1.8827 1.2211 1.5310 1.4490 1.8985 1.4579 1.5635 2.4840 1.8141 2.8142 2.0658 2.2069 1.7552 2.3804 2.0135 2.5561 2.2026 2.3599 2.4633 1.9302 1.8205 1.8369 1.7362 1.6849 2.2246 1.9042 1.6833 2.5151 1.6085 1.4364 1.6456 1.4574 1.3241 1.4757 1.4120 2.2558 1.4059 1.2734 1.4988 1.1947 2.4932 1.3892 1.1919 1.2331 2.7791 1.0947 1.0933 1.0439 1.0510 1.1343 1.0713 1.2470 1.0900 1.1176 1.0648 1.0805 1.3844 1.1220 7.1576 9.2306 7.0805 8.8378 1.0652 1.0348 1.0603 1.0571 1.0616 1.0372 1.0641 1.0615 1.0785 1.0364 1.0972 1.1012 1.0963 1.1028 1.1001 1.0990 1.0995 1.1005 1.0996 1.0991 1.0991 1.1000 1.0878 1.0907 1.0946 1.0639
irintensity: 1.1527 0.6527 1.1567 0.1999 0.3666 0.7469 0.2282 0.4566 0.4409 0.1403 1.4290 0.2634 3.2906 0.1046 0.0893 0.8714 0.2768 0.6026 0.7740 0.6909 0.8683 7.2540 0.4248 0.3134 3.2603 1.5155 0.8834 1.9092 5.4017 2.5577 2.7724 0.1208 2.9799 10.4325 39.9233 12.8501 45.9583 42.2714 35.7075 1.0957 4.7387 2.0641 16.2225 19.2311 1.3531 5.6103 5.0202 12.0527 21.1424 2.7136 2.6403 11.9349 1.6121 3.2673 2.4530 10.8709 0.0301 19.7766 4.2785 16.9245 120.7869 57.7490 121.6969 5.6982 40.2454 21.8627 2.6816 29.0983 1.0901 3.7298 2.7527 4.1015 0.9787 1.4192 0.7091 31.9901 4.8907 15.6415 14.4956 1.8088 122.8748 4.2873 34.1310 14.2372 2.3206 0.6548 3.2106 5.4140 24.9464 0.2898 3.3120 4.0858 16.0446 9.3368 13.5984 21.3153 8.6474 26.4301 7.7561 3.7975 2.8192 3.0143 4.0538 14.8195 6.8623 16.5134 8.2215 5.9682 10.5797 49.4273 13.7116 6.1396 175.0508 13.6384 174.9587 4.6021 31.8108 21.0669 31.8030 28.1421 25.8028 21.7866 23.5524 17.2251 25.3726 23.3842 41.4745 5.2603 48.5061 0.2253 30.0505 105.9714 25.1296 38.9189 42.0337 27.7501 18.2476 16.9595 8.0932 19.7923 28.2635
temp: 298.150 k
press: 1.00000 atm
elementType: 8 8 8 6 6 6 6 6 6 6 6 6 6 6 6 6 6 6 6 6 6 6 6 1 1 1 1 1 1 1 1 1 1 1 1 1 1 1 1 1 1 1 1 1 1 1 1 1 1
symmnumber: 1
zpe: 1087854.4 jmol-1
zpe.correction: 0.414342 hartree
zpe.thermalcorrener: 0.436900 hartree
zpe.thermalcorrenthalpy: 0.437844 hartree
zpe.thermalcorrgfe: 0.363053 hartree
zpe.sumelectzpe: -1001.691464 hartree
zpe.sumelectthermal: -1001.668906 hartree
zpe.sumelectthermalent: -1001.667962 hartree
zpe.sumelectthermalfe: -1001.742752 hartree
dipole: -1.3216 4.3875 0.8074
dipole: 4.6528
quadrupole: -118.3551 -143.2977 -141.6881
quadrupole: 5.6020 -1.4205 -0.2786
quadrupole: 16.0919 -8.8507 -7.2411 5.6020 -1.4205 -0.2786
hfenergy: -1002.1058054 hartree
pointgroup: C01 [X(C20H26O3)]
dipole: 0.5030429 -1.7242995 0.3531448 debye
polarizability: 286.8831323|1.279752|212.9881161|11.169702|1.4781736|162.1529028 unknown
InChI: InChI=1S/C20H26O3/c1-12(2)13-6-7-15-14(10-13)16(21)11-17-19(15,3)8-5-9-20(17,4)18(22)23/h6-7,10,12,17,22H,5,8-9,11H2,1-4H3
charge 0 multiplicity 1
49 atoms
O  5.142889 1.234021 -0.56083
O  -0.919572 2.90527 0.442046
O  3.287284 1.323551 -1.929237
C  0.75179 -1.071715 0.409651
C  1.57476 0.215966 0.057795
C  3.136118 0.08088 0.24111
C  1.231382 -2.246355 -0.531174
C  3.598229 -1.399298 -0.050215
C  2.675839 -2.078322 -1.076352
C  1.025022 1.478099 0.756758
C  -0.751713 -0.787966 0.178967
C  0.880457 -1.509865 1.906079
C  3.667441 0.512013 1.635153
C  -1.302281 0.52987 0.199526
C  -0.445724 1.729749 0.449152
C  3.800494 0.941132 -0.852422
C  -1.656036 -1.863345 -0.008413
C  -2.693796 0.737741 0.007714
C  -3.586202 -0.33562 -0.190336
C  -3.037508 -1.645424 -0.188834
C  -5.085505 -0.106268 -0.394478
C  -5.36321 0.716402 -1.6812
C  -5.730874 0.573116 0.843028
H  1.417236 0.372609 -1.028642
H  0.542413 -2.333673 -1.391153
H  1.162585 -3.199739 0.028843
H  3.585089 -1.962065 0.902305
H  4.649466 -1.396487 -0.393053
H  3.0789 -3.071341 -1.351833
H  2.664198 -1.478045 -2.00668
H  1.585699 2.382485 0.458216
H  1.122085 1.396368 1.85884
H  1.895616 -1.866382 2.149302
H  0.622145 -0.689016 2.599281
H  0.180625 -2.340738 2.108406
H  3.53257 1.59133 1.818463
H  3.144695 -0.041177 2.43277
H  4.746428 0.298776 1.710955
H  -1.278592 -2.891767 -0.019771
H  -3.04513 1.775903 0.029042
H  -3.704365 -2.505026 -0.333905
H  5.527584 1.748588 -1.321759
H  -5.561529 -1.100189 -0.520168
H  -4.913322 1.723968 -1.610594
H  -6.451324 0.841123 -1.834565
H  -4.940859 0.220116 -2.573462
H  -5.568425 -0.023622 1.758736
H  -6.82015 0.693514 0.69503
H  -5.299526 1.577053 1.012204
