program: Gaussian 09
title: 000029140
version: EM64L-G09RevD.01
frameworkgroup: C1[X(C8H8ClNO2)]
method: RPBEPBE
basis: SDD
operation: Freq
keyword: #p
keyword: freq=noraman
keyword: PBEPBE/SDD
title: #p freq=noraman PBEPBE/SDD
converged: YES YES NO NO
title: Mulliken charges:
elementType: Cl O O N C C C C C C C C H H H H H H H H
charge: -0.051762 -0.461357 -0.280419 -0.595133 0.484239 -0.295757 -0.359018 -0.450287 0.179353 -0.200664 -0.204870 -0.108697 0.242260 0.274118 0.251471 0.258235 0.258953 0.367960 0.351292 0.340084
chargesum: 0.00000
title: Mulliken charges with hydrogens summed into heavy atoms:
elementType: Cl O O N C C C C C C C C
charge: -0.051762 -0.093396 -0.280419 0.096243 0.484239 -0.053497 -0.084900 -0.198816 0.179353 0.057570 0.054082 -0.108697
polarizability: 1.55776724e+02 8.62342689e+00 8.98330607e+01 -2.89350266e+00 1.41483548e+01 7.24255712e+01
1716.lowfreq: -15.6279 -6.4577 -1.5970 -0.0024 -0.0020 0.0009 40.4050 53.8240 58.5066
frequency: 40.2579 53.8168 58.4972 152.8837 161.7553 264.6466 289.9866 320.4150 344.6675 409.1304 429.0934 459.0740 476.6115 521.2281 550.7280 580.2785 616.0730 627.1839 646.7367 700.0171 715.4101 805.7198 832.3857 840.9095 869.9558 950.3897 974.8429 998.9849 1032.4151 1067.0018 1071.3309 1109.1807 1177.0279 1189.7584 1207.2025 1277.7845 1301.3744 1339.0436 1378.7767 1384.8107 1397.3437 1476.1722 1586.6663 1588.2676 1599.3739 1647.9066 2931.5705 3117.3273 3156.7618 3168.8972 3176.0806 3366.8621 3509.8183 3658.4735
redmass: 5.0841 6.2667 6.9236 6.6560 8.5260 8.9057 4.9829 5.7613 5.3187 2.9167 4.2474 4.4336 2.3016 1.8634 1.5340 1.2106 3.1667 5.6970 2.0390 4.3620 4.0703 1.9392 1.4476 2.8138 2.6520 1.3665 1.3685 4.2571 5.4676 2.0185 2.6809 1.3836 1.1671 1.6087 1.5840 1.2474 1.3260 2.9803 2.4268 3.2597 2.3390 2.4692 3.1992 2.0305 5.8812 3.4126 1.0818 1.0899 1.0885 1.0950 1.0973 1.0640 1.0449 1.1044
irintensity: 1.7972 4.2298 3.3308 2.0693 3.2256 3.4380 14.9379 5.8849 13.3734 0.3803 22.2575 14.1223 29.6342 16.1968 68.1059 145.1056 45.5615 4.2864 111.0819 36.6088 2.2851 33.4355 6.9142 21.3571 41.6533 2.3663 0.9619 41.0583 65.4139 8.3449 40.3013 8.2999 8.7268 54.8054 3.7762 21.6140 45.3055 121.0362 37.1922 17.1123 4.5733 79.7402 30.6524 60.5710 9.1625 255.5940 36.7297 10.6675 0.5430 3.7860 1.4106 76.9092 31.2657 60.1645
temp: 298.150 k
press: 1.00000 atm
elementType: 17 8 8 7 6 6 6 6 6 6 6 6 1 1 1 1 1 1 1 1
symmnumber: 1
zpe: 386447.1 jmol-1
zpe.correction: 0.147190 hartree
zpe.thermalcorrener: 0.158383 hartree
zpe.thermalcorrenthalpy: 0.159327 hartree
zpe.thermalcorrgfe: 0.108691 hartree
zpe.sumelectzpe: -974.044672 hartree
zpe.sumelectthermal: -974.033479 hartree
zpe.sumelectthermalent: -974.032534 hartree
zpe.sumelectthermalfe: -974.083170 hartree
dipole: 0.3470 3.8563 -0.2527
dipole: 3.8801
quadrupole: -93.3411 -69.9880 -75.6630
quadrupole: -7.2655 -0.2516 4.2078
quadrupole: -13.6770 9.6760 4.0011 -7.2655 -0.2516 4.2078
hfenergy: -974.1918618 hartree
pointgroup: C01 [X(C8H8Cl1N1O2)]
dipole: 0.0182734 1.4853252 0.3518921 debye
dipolederiv: -0.8240846 0.0746373 0.1996693 0.087917 -0.1196966 0.0015841 0.2260926 0.0014664 -0.1432971 -0.5604646 0.0720438 0.0949761 0.2418062 -0.6263486 -0.0541158 0.1815512 -0.1148345 -0.509339 -1.020916 0.3544888 -0.0183041 0.1896398 -0.6931724 -0.1482988 -0.3405384 -0.0124514 -0.4641032 -0.4603511 -0.017251 0.1294582 0.0141898 -1.0055907 -0.1423817 0.1311921 -0.2082445 -0.6022153 0.2572654 0.0333823 0.0405878 -0.027387 -0.1105985 -0.0275362 -0.0443267 -0.0086625 -0.103087 0.2042662 -0.1430309 -0.2427178 -0.2060371 0.5155602 -0.0033164 -0.3820783 -0.0637758 0.2419186 -0.1130033 -0.0612927 -0.0165652 -0.060559 0.0341914 -0.0678503 -0.0403353 -0.01904 -0.0630059 -0.0972375 -0.0276159 -0.0765754 -0.0540377 -0.0291837 -0.0820398 -0.0627817 -0.1255869 -0.0776436 1.0195864 -0.464772 0.1197372 -0.2285778 1.0544098 0.3604248 0.5059568 0.3224589 0.5284187 -0.2658166 0.0851582 0.0058842 0.0782736 -0.0189516 -0.0692112 0.0311622 -0.0730033 -0.0613253 -0.2658483 -0.0288007 0.0895736 -0.0618312 -0.0166633 -0.0270367 0.1006812 -0.0467896 -0.1086345 1.1521605 -0.1428335 -0.3484878 -0.1327332 0.0732398 -0.0436166 -0.3756475 -0.028969 0.0815238 0.0035545 0.001901 0.007232 -0.0391438 -0.1056101 0.0915682 0.0372699 0.0861456 -0.0486487 0.0794864 0.0650347 -0.0118984 0.0518265 0.0392046 0.0543555 -0.0189507 0.0387411 0.1274263 0.0400531 -0.0556215 0.0865628 -0.0433068 0.0324356 0.0846116 0.0865424 0.0981064 0.0583446 0.0628392 -0.0398169 0.0564539 -0.0324499 0.0486199 0.0752887 0.0632429 0.0749062 0.0965732 0.0519324 0.0744228 -0.007938 0.0758297 0.0285077 0.0587889 -0.0013744 0.0570149 0.1313679 0.2478941 0.0650911 0.0020783 -0.0421122 0.388387 0.0508212 -0.033587 0.1165162 0.380344 0.2781877 0.0962193 -0.0495806 0.1225881 0.2648238 -0.0437854 0.0101235 -0.0313483 0.2630495 0.2104962 0.0586558 -0.0601462 0.0661049 0.2464359 -0.0682541 -0.074195 -0.06265 0.2723331 unknown
polarizability: 152.1345665|-13.7967157|95.6780301|-13.8605987|-8.7256729|70.2227597 unknown
InChI: InChI=1S/C8H8ClNO2/c9-6-3-1-5(2-4-6)7(11)8(10)12/h1-4,7,11H,10H2
charge 0 multiplicity 1
20 atoms
Cl -4.217803 0.421944 0.755198
O  1.993109 -1.593894 -1.258807
O  3.680422 -0.382775 0.382426
N  2.342506 1.493587 0.724511
C  0.193534 -0.071312 -0.588533
C  1.657528 -0.210985 -0.983692
C  -0.426843 -1.063078 0.21044
C  -0.55718 1.059927 -0.993446
C  2.642694 0.300913 0.12124
C  -1.768561 -0.919278 0.621964
C  -1.902269 1.22205 -0.58663
C  -2.483375 0.228968 0.223838
H  1.852375 0.415339 -1.883026
H  0.141289 -1.958298 0.480585
H  -0.108437 1.810175 -1.657279
H  -2.252041 -1.685458 1.234898
H  -2.485631 2.090332 -0.906052
H  2.892752 -1.748753 -0.842543
H  1.443958 1.950814 0.571017
H  2.984472 1.871184 1.42129
