program: Gaussian 09
title: 000029177
version: EM64L-G09RevD.01
frameworkgroup: C1[X(C21H28N2O3)]
method: RPBEPBE
basis: SDD
operation: Freq
keyword: #p
keyword: freq=noraman
keyword: PBEPBE/SDD
title: #p freq=noraman PBEPBE/SDD
converged: YES YES NO NO
title: Mulliken charges:
elementType: O O O N N C C C C C C C C C C C C C C C C C C C C C H H H H H H H H H H H H H H H H H H H H H H H H H H H H
charge: -0.242480 -0.305116 -0.259707 -0.215293 -0.114908 0.208103 0.058739 -0.519183 0.180981 -0.412561 0.238435 -0.495236 0.090175 -0.533895 -0.340706 -0.622718 0.241964 -0.364397 -0.360140 -0.405889 0.153349 -0.249664 -0.318608 -0.318272 -0.674265 -0.672829 0.230198 0.227838 0.220136 0.212222 0.233046 0.245261 0.274949 0.237533 0.218254 0.258684 0.257859 0.272034 0.219716 0.197050 0.193333 0.210194 0.226921 0.251084 0.186675 0.202684 0.185287 0.201871 0.206393 0.209412 0.225684 0.203792 0.220507 0.225501
chargesum: 0.00000
title: Mulliken charges with hydrogens summed into heavy atoms:
elementType: O O O N N C C C C C C C C C C C C C C C C C C C C C
charge: -0.242480 -0.305116 -0.259707 -0.215293 -0.114908 0.208103 0.058739 -0.061146 0.180981 0.019797 0.238435 -0.016929 0.090175 -0.258947 -0.103173 0.112080 0.241964 -0.092363 0.056627 -0.002362 0.153349 0.228341 0.070750 0.068887 -0.032775 -0.023029
polarizability: 3.79230363e+02 3.63294234e+01 2.60254443e+02 -2.92067215e+01 1.75721925e+01 1.76033054e+02
1716.lowfreq: -99.1496 -10.9594 -8.0811 -4.2209 -1.6546 -0.0008 -0.0004 0.0010 14.1381
frequency: -99.1277 -7.9985 14.0346 23.1816 36.3047 52.3725 58.6614 75.1376 83.3730 88.1199 94.4946 104.1006 130.3585 148.7801 155.5988 186.6298 192.6272 207.4095 223.5684 236.8045 244.9374 254.3293 282.8597 288.2592 293.9678 313.3521 329.1642 351.8407 372.1715 394.8197 408.5713 429.8703 432.6468 457.8039 460.7712 468.7653 516.5896 532.0385 563.9131 570.9455 594.6360 604.6825 643.3195 659.9196 696.7529 708.2303 727.3457 763.8171 774.1774 783.2513 795.4680 800.2998 808.4634 830.5587 854.4849 856.4826 867.6803 892.9949 897.0655 919.1017 929.5577 951.6703 963.0886 980.8436 1006.9780 1024.1163 1041.9777 1047.6381 1052.0542 1052.5207 1073.7534 1077.2280 1084.7142 1085.5151 1101.6833 1113.7459 1118.7870 1120.9926 1138.3935 1152.8110 1161.6231 1187.0180 1194.9161 1210.4968 1213.1602 1236.4400 1244.7753 1249.5050 1256.5808 1277.3236 1286.0886 1290.6023 1301.2423 1313.2634 1332.1842 1343.1290 1348.6537 1355.6964 1359.6755 1363.3610 1376.4225 1379.9827 1387.5625 1390.3880 1399.6182 1429.1387 1440.9324 1443.8888 1446.0867 1457.7793 1458.8843 1459.8281 1462.4335 1465.5944 1469.6856 1471.8657 1476.7587 1478.8200 1482.1814 1483.7094 1486.2879 1486.5715 1490.5898 1529.5132 1567.4590 1581.0333 1611.2568 1624.3328 2847.7105 2856.1262 2876.1812 2955.2226 2968.7556 2983.1590 2983.4906 2989.3203 2991.8656 3011.8112 3015.4488 3018.5377 3025.1439 3035.5537 3040.2729 3054.0780 3058.2718 3065.2240 3075.5583 3077.6238 3087.0266 3089.2181 3090.6057 3102.8727 3121.5710 3145.1908 3165.1150 3168.2750
redmass: 1.0161 3.9244 4.5080 3.3409 5.3177 3.6811 8.2684 2.9231 3.3503 2.0834 3.0682 3.3877 4.2223 2.9469 2.2913 2.5089 2.7473 1.5010 1.8170 2.7476 3.7167 3.8590 2.1093 3.9989 2.1477 4.0207 2.3273 3.8671 3.2937 3.6190 5.4886 2.5791 2.9053 3.1923 2.6679 2.9656 2.9931 5.1447 4.6019 3.5416 4.8175 4.6477 4.0277 6.1777 2.4880 4.4356 5.2224 3.8635 3.8777 1.5079 1.1428 1.6426 3.9967 1.5917 1.6679 2.4894 2.7102 2.3883 2.5715 2.1030 1.5353 3.2716 1.9728 1.3394 3.2042 1.8523 2.5987 2.3488 3.3901 2.3127 2.0458 1.9583 2.0811 2.1656 2.1603 1.9815 1.3295 1.7715 1.3740 1.3249 1.6577 1.4944 1.4677 1.6041 2.6414 1.5047 1.8703 1.4781 2.3386 1.1277 1.2655 1.2238 1.8100 1.4029 1.7107 1.3730 1.6055 1.5318 1.3881 1.3312 1.6311 2.2874 1.2365 1.2331 5.4554 2.4678 1.5172 1.4971 1.0933 1.0403 1.1217 1.0599 1.0549 1.1054 1.1413 1.0659 1.5194 1.0588 1.1378 3.3613 1.4961 1.2434 1.0746 6.8470 6.6626 9.0261 11.7472 7.4776 1.0719 1.0718 1.0715 1.0661 1.0665 1.0357 1.0357 1.0600 1.0620 1.0331 1.0594 1.0869 1.0925 1.0870 1.0952 1.1012 1.0920 1.0956 1.0986 1.0981 1.1076 1.1003 1.1004 1.1018 1.1020 1.0878 1.0934 1.0954
irintensity: 0.0128 0.0312 0.0213 0.1051 0.0191 0.0259 2.6725 0.2291 6.7531 1.1771 0.1285 0.3756 0.6823 0.4449 1.8837 5.7686 0.5399 0.7873 5.7352 4.5463 8.6063 4.5121 3.0118 5.3802 3.8373 0.6209 4.9027 1.0189 2.9689 7.2008 4.5012 6.0747 5.0311 1.6843 2.3625 3.4052 0.1955 12.6908 0.1552 2.3572 1.8169 3.9567 8.3139 3.2241 13.2647 15.0725 22.9289 2.4999 3.9111 2.2037 4.4957 6.7895 1.3392 29.4883 0.2984 16.1452 33.0749 27.2264 16.6529 14.9203 12.0979 25.1952 7.1544 0.7582 17.5018 8.7976 29.5531 14.2488 237.4710 42.0657 7.4972 21.5778 20.2940 55.3645 78.3180 7.0513 2.6135 25.6314 1.0027 61.3102 12.0400 16.8971 48.0124 15.6540 274.8823 104.5707 27.7437 2.3312 52.9873 1.3815 15.8822 22.8060 70.7383 3.6588 1.5701 1.1795 10.7776 6.2346 4.0571 4.6578 14.7709 64.2820 20.3074 21.9458 88.5098 20.9057 13.8651 13.9113 9.2247 12.2193 7.7953 4.7938 7.7728 8.3011 14.1928 9.8660 27.9333 3.5391 27.0852 25.7321 11.3015 12.2242 15.7833 22.3338 77.0537 413.5630 215.0903 83.6477 44.2686 103.5671 169.5961 22.9583 13.2243 44.4027 18.1137 30.6953 35.7010 36.7570 23.0028 22.9124 30.6082 21.1616 12.0291 51.7420 50.5014 21.5574 50.3977 72.0399 18.8151 34.2891 43.2665 12.8985 9.9428 5.2055 6.3397 3.8218
temp: 298.150 k
press: 1.00000 atm
elementType: 8 8 8 7 7 6 6 6 6 6 6 6 6 6 6 6 6 6 6 6 6 6 6 6 6 6 1 1 1 1 1 1 1 1 1 1 1 1 1 1 1 1 1 1 1 1 1 1 1 1 1 1 1 1
symmnumber: 1
zpe: 1186333.9 jmol-1
zpe.correction: 0.451851 hartree
zpe.thermalcorrener: 0.476790 hartree
zpe.thermalcorrenthalpy: 0.477734 hartree
zpe.thermalcorrgfe: 0.395344 hartree
zpe.sumelectzpe: -1150.272506 hartree
zpe.sumelectthermal: -1150.247567 hartree
zpe.sumelectthermalent: -1150.246623 hartree
zpe.sumelectthermalfe: -1150.329013 hartree
dipole: 1.2979 -3.1457 -0.7348
dipole: 3.4814
quadrupole: -164.1570 -151.9319 -151.9023
quadrupole: -14.8239 -0.2034 5.8767
quadrupole: -8.1599 4.0652 4.0947 -14.8239 -0.2034 5.8767
hfenergy: -1150.7243572 hartree
pointgroup: C01 [X(C21H28N2O3)]
dipole: 0.5278624 -1.1647348 -0.490673 debye
polarizability: 380.4920533|39.9540876|251.258702|-15.5130142|32.7834591|183.7671047 unknown
InChI: InChI=1S/C21H28N2O3/c1-4-23(5-2)12-7-13-26-21(25)15-10-11-18-17(14-15)16-8-6-9-19(24)20(16)22(18)3/h10-11,14H,4-9,12-13H2,1-3H3
charge 0 multiplicity 1
54 atoms
O  -6.369317 -1.048297 0.122102
O  2.216703 0.95609 -0.890295
O  2.092679 3.022328 0.182593
N  -3.970632 0.741484 0.482463
N  5.034741 -1.189901 0.329206
C  -2.749648 -0.854354 -0.658103
C  -4.026903 -0.518141 -0.164582
C  -2.477582 -2.142771 -1.39091
C  -1.869369 0.229154 -0.312925
C  -3.551324 -3.199621 -1.02345
C  -2.662777 1.210131 0.400766
C  -4.985349 -2.628709 -1.152718
C  -5.218694 -1.350524 -0.332324
C  -0.48827 0.46244 -0.52622
C  -2.084792 2.410332 0.8882
C  -5.100104 1.429858 1.126248
C  0.084706 1.654768 -0.038541
C  -0.718523 2.617453 0.661094
C  4.175587 -1.319029 -0.876805
C  4.232065 -0.064502 -1.779578
C  1.528815 1.970786 -0.217105
C  3.682524 1.180418 -1.086789
C  6.455887 -1.533012 0.052985
C  4.480975 -1.894205 1.517937
C  7.443412 -0.862362 1.027458
C  3.304172 -1.137748 2.163806
H  -1.465778 -2.521962 -1.152322
H  -2.491932 -1.965665 -2.487442
H  -3.387375 -3.535194 0.019048
H  -3.446101 -4.088329 -1.673321
H  -5.193241 -2.379394 -2.215115
H  -5.746456 -3.367198 -0.844741
H  0.136278 -0.257693 -1.062268
H  -2.672993 3.159279 1.427041
H  -4.747939 2.390245 1.533881
H  -5.908414 1.613468 0.40037
H  -5.516291 0.81595 1.9412
H  -0.22363 3.526907 1.016851
H  3.129768 -1.458303 -0.551477
H  4.447671 -2.220534 -1.479607
H  5.280037 0.144892 -2.072035
H  3.666582 -0.254517 -2.712762
H  3.81429 2.097508 -1.688648
H  4.151788 1.32027 -0.097359
H  6.61453 -2.642125 0.055834
H  6.690318 -1.190112 -0.972496
H  4.167041 -2.938311 1.261512
H  5.290909 -1.987323 2.263943
H  8.485149 -1.122969 0.761889
H  7.276051 -1.182139 2.071805
H  7.331058 0.235185 0.987742
H  2.92434 -1.690401 3.043551
H  2.462755 -1.004212 1.459882
H  3.631101 -0.134685 2.489433
