program: Gaussian 09
title: 000029132
version: EM64L-G09RevD.01
frameworkgroup: C1[X(C13H10O)]
method: RPBEPBE
basis: SDD
operation: Freq
keyword: #pfreq=noraman
keyword: PBEPBE/SDD
title: #p freq=noraman PBEPBE/SDD
converged: YES YES NO NO
title: Mulliken charges:
elementType: O C C C C C C C C C C C C C H H H H H H H H H H
charge: -0.269096 0.142870 0.435854 0.241806 -0.452190 -0.369213 -0.421886 -0.391914 -0.243695 -0.236362 -0.237994 -0.357659 0.192144 -0.456322 0.237368 0.274039 0.237233 0.242454 0.223823 0.228338 0.226537 0.237437 0.237595 0.278833
chargesum: 0.00000
title: Mulliken charges with hydrogens summed into heavy atoms:
elementType: O C C C C C C C C C C C C C
charge: -0.269096 0.142870 0.435854 0.241806 -0.214822 -0.095174 -0.184653 -0.149460 -0.019872 -0.008024 -0.011457 0.117373 0.192144 -0.177489
polarizability: 2.00927360e+02 -7.68310220e-01 1.71568227e+02 4.27018416e-02 -9.56569248e-04 5.86704051e+01
1716.lowfreq: -10.0742 -9.0699 -0.0009 -0.0006 -0.0006 6.1362 43.4073 82.4486 104.5366
frequency: 43.3935 82.4455 104.5325 139.8957 185.2068 206.1269 258.5691 275.7978 329.4868 397.0958 419.3918 462.5369 471.7203 512.3737 533.8990 572.2234 615.3709 636.9945 641.6149 683.7804 722.6433 740.0786 782.1605 782.1848 806.8056 847.5635 860.8792 892.5437 927.3314 961.8103 975.6829 987.9819 993.4960 996.7517 1022.3506 1055.6473 1085.0201 1146.9988 1171.8517 1185.0032 1204.1461 1229.0475 1236.3067 1268.9942 1348.6623 1378.6298 1404.4386 1428.0450 1439.5692 1451.9783 1467.0578 1516.1425 1582.9251 1597.4743 1635.6916 2159.6799 2948.1605 3000.6399 3121.2985 3128.0327 3136.2456 3148.9280 3155.2853 3169.1689 3174.6405 3427.0558
redmass: 5.0110 4.7285 2.7349 4.6816 3.9483 4.9824 4.1243 5.7741 3.1417 5.9086 3.1088 5.3069 3.2875 7.2344 6.4033 3.2675 7.5463 1.2307 3.2133 1.2583 6.6855 1.3141 1.6044 4.9701 2.0017 5.4204 1.4407 1.6515 7.3252 1.3332 1.3860 3.6103 1.5909 1.3348 2.6342 3.4313 2.2150 1.4396 1.0758 1.2730 1.0528 1.8983 2.1749 1.7513 1.3142 2.2601 3.1490 5.4872 2.4853 2.2356 1.1606 3.9018 6.9953 5.7118 6.9453 6.0028 1.0544 1.1049 1.0862 1.0860 1.0903 1.0939 1.0962 1.0959 1.0973 1.1613
irintensity: 0.5830 0.4305 5.5476 3.3690 0.8301 2.8096 0.0269 0.4119 9.2924 0.4487 6.9637 4.4936 0.0849 0.2748 4.2870 11.7422 3.9346 74.5901 0.6300 56.7315 11.7041 2.4580 94.3660 3.6002 65.7094 2.8206 0.1795 3.1620 37.1732 0.0435 5.1835 41.0539 1.3123 0.0096 30.4245 125.2455 41.8869 6.2557 2.7784 16.5168 0.2809 109.6304 67.8513 29.7997 52.5700 4.7542 27.6721 26.5797 5.9778 29.0156 2.7881 25.3420 74.9452 5.2240 4.8683 1.8975 30.8518 20.8123 1.3846 1.0722 15.9108 34.0576 33.2511 21.8334 11.0413 67.2031
temp: 298.150 k
press: 1.00000 atm
elementType: 8 6 6 6 6 6 6 6 6 6 6 6 6 6 1 1 1 1 1 1 1 1 1 1
symmnumber: 1
zpe: 486135.4 jmol-1
zpe.correction: 0.185159 hartree
zpe.thermalcorrener: 0.196830 hartree
zpe.thermalcorrenthalpy: 0.197774 hartree
zpe.thermalcorrgfe: 0.147006 hartree
zpe.sumelectzpe: -575.569408 hartree
zpe.sumelectthermal: -575.557737 hartree
zpe.sumelectthermalent: -575.556793 hartree
zpe.sumelectthermalfe: -575.607562 hartree
dipole: 0.9129 1.1331 -0.0039
dipole: 1.4551
quadrupole: -65.0525 -70.6683 -87.0839
quadrupole: 0.7633 -0.0022 0.0137
quadrupole: 9.2157 3.5999 -12.8157 0.7633 -0.0022 0.0137
hfenergy: -575.7545675 hartree
pointgroup: C01 [X(C13H10O1)]
dipole: 0.3324964 -0.4647158 0.0347004 debye
dipolederiv: -1.9314945 -0.2298562 0.0028715 -0.3999246 -0.3487687 0.0027532 0.0147886 0.0043445 -0.2631506 -0.328555 -0.1646618 0.0086561 0.0006628 0.0403801 -0.0034975 -0.0021585 -0.004433 -0.0078254 -0.0439702 -0.0673652 0.0037689 -0.075302 0.2040633 -0.00971 0.0044204 -0.0097187 0.0644473 1.4302394 0.2314158 -0.0060188 0.8023937 0.2684919 -0.0061401 -0.0454006 -0.011046 0.0836147 -0.0904907 0.1371921 -0.0085423 0.0792301 -0.1347138 -0.0047004 -0.0045065 -0.0044011 -0.2121522 0.011489 0.098589 -0.0057289 -0.0529489 -0.0451944 -0.0064922 0.0042865 -0.0056238 -0.1369407 0.1011405 0.0666698 -0.0027554 0.0890138 -0.0963246 -0.0051679 -0.0042102 -0.0052431 -0.1814204 -0.2130961 0.0516258 -0.0037665 -0.443637 -0.221561 -0.0032358 0.0295119 0.0003459 -0.2231916 0.2257998 -0.0492311 0.0057201 0.1474008 0.113821 -0.0166287 -0.0075261 -0.0177553 -0.1513239 -0.099521 0.0024761 0.000232 0.1092017 0.1025596 -0.0176338 -0.0068522 -0.0181435 -0.1719101 0.1253197 -0.0245933 0.0032501 -0.0620738 -0.000788 -0.0106718 0.0057237 -0.0104322 -0.1552322 1.3900934 0.1077237 0.0011595 -0.3018075 0.3337559 0.0024834 0.0295221 0.0060137 0.3986401 -0.0947165 0.0658181 -0.0045246 -0.0021716 -0.0940882 0.0016629 -0.0005093 0.0022923 -0.0622493 -0.4566891 -0.0452631 0.0018948 -0.0997808 -0.2639096 -0.0032415 0.0050802 -0.0028438 -0.3044934 -0.0867961 -0.1050336 0.0054313 -0.0344559 0.0416587 0.0081317 0.000752 0.0076983 0.1665339 0.0155277 -0.0815919 0.0046581 -0.0595167 0.0679984 0.0056004 0.0031594 0.0055627 0.1584531 -0.0819075 -0.0451538 0.0015651 -0.1119331 0.0347283 0.00742 0.0060234 0.0078225 0.1557302 -0.075141 0.098584 -0.0080061 0.1179626 0.0509477 0.0090647 -0.0093485 0.0089132 0.1745176 0.0773623 -0.0076703 -0.0000034 -0.0285178 -0.1379597 0.0193572 0.0014089 0.0194499 0.1562474 0.080936 -0.0151136 0.0005304 0.0012121 -0.1379243 0.0198509 -0.0005343 0.0196572 0.1587906 -0.0756411 0.1126592 -0.0089052 0.1168486 0.0129349 0.0104906 -0.0091208 0.0104034 0.1592814 -0.0663832 -0.0632593 0.024532 0.1059441 0.0026454 0.0871689 -0.0262363 0.0920357 -0.0485956 -0.0673281 -0.0635386 -0.0163691 0.1103169 -0.0207722 -0.0892381 0.0115631 -0.097217 -0.0253316 0.2538225 -0.010422 0.0003501 -0.0081174 0.2280194 0.002374 0.0001631 0.0023182 0.267561 unknown
polarizability: 200.9088801|-0.876344|171.0921499|1.1245338|-7.3959903|59.1649616 unknown
InChI: InChI=1S/C13H10O/c1-2-10-14-13-9-5-7-11-6-3-4-8-12(11)13/h1,3-9H,10H2
charge 0 multiplicity 1
24 atoms
O  1.662805 0.166796 0.078564
C  -0.729796 0.301437 0.054563
C  -2.030074 -0.332417 0.088939
C  0.444012 -0.536759 0.11749
C  -2.119927 -1.76246 0.183549
C  -0.640173 1.727065 -0.039994
C  -3.198273 0.497251 0.026815
C  0.333965 -1.929929 0.209484
C  -0.962022 -2.53564 0.241885
C  -1.799588 2.50605 -0.098726
C  -3.088617 1.88697 -0.065143
C  2.896574 -0.644935 0.143229
C  4.053347 0.252273 0.098567
C  5.054093 0.968555 0.064082
H  -3.108293 -2.234755 0.209024
H  0.350706 2.188834 -0.065017
H  -4.184688 0.018955 0.052823
H  1.21684 -2.573489 0.257484
H  -1.031146 -3.626589 0.313668
H  -1.723808 3.596557 -0.170692
H  -3.990023 2.508173 -0.111734
H  2.903429 -1.235497 1.083111
H  2.922665 -1.349795 -0.713916
H  5.921192 1.603249 0.034044
