program: Gaussian 09
title: 000029169
version: EM64L-G09RevD.01
frameworkgroup: C1[X(C17H22N2O)]
method: RPBEPBE
basis: SDD
operation: Freq
keyword: #p
keyword: freq=noraman
keyword: PBEPBE/SDD
title: #p freq=noraman PBEPBE/SDD
converged: YES YES NO NO
title: Mulliken charges:
elementType: O N N C C C C C C C C C C C C C C C C C H H H H H H H H H H H H H H H H H H H H H H
charge: -0.257711 -0.209222 -0.104532 0.210106 0.053709 -0.518810 0.144646 0.204632 -0.411695 -0.396559 -0.497127 0.108221 -0.435635 -0.413334 -0.346791 -0.348113 -0.251178 -0.230850 -0.626720 -0.608208 0.223512 0.225260 0.209129 0.218152 0.243561 0.254015 0.241010 0.230643 0.248127 0.215748 0.235846 0.195824 0.212262 0.251734 0.223072 0.222884 0.235078 0.192338 0.220865 0.227032 0.219790 0.189289
chargesum: 0.00000
title: Mulliken charges with hydrogens summed into heavy atoms:
elementType: O N N C C C C C C C C C C C C C C C C C
charge: -0.257711 -0.209222 -0.104532 0.210106 0.053709 -0.070037 0.144646 0.204632 0.015586 0.101017 -0.025475 0.108221 0.028239 -0.177488 -0.095057 0.059973 -0.028106 -0.007965 0.021561 0.027904
polarizability: 2.35792900e+02 -3.36387502e+00 2.67791931e+02 1.03416122e+01 4.40610374e+00 1.19498055e+02
1716.lowfreq: -13.6704 -6.6618 -0.0003 0.0002 0.0004 2.6472 11.9427 23.5429 34.3562
frequency: 7.7804 22.7848 34.2693 56.7841 83.5337 87.5840 96.4941 149.1412 174.0642 205.5645 222.6543 227.1240 239.7953 256.2076 292.0765 293.9868 302.9757 334.8935 357.8408 369.1063 406.7567 427.9641 433.3986 463.6201 493.9882 513.7648 555.5937 568.8809 589.4773 619.3339 630.0687 661.8976 718.5559 733.6854 754.5671 761.3199 781.6258 804.6691 834.3748 851.2414 860.5671 874.3568 896.7435 927.6452 940.8171 971.1695 975.3237 1008.3822 1010.9466 1033.6077 1042.3370 1052.8263 1058.2500 1070.8260 1081.2182 1090.9637 1101.7286 1131.8080 1136.0633 1136.8240 1156.5747 1176.3277 1186.3640 1208.9881 1234.2437 1242.6778 1254.9813 1262.8926 1269.5828 1292.9284 1311.0954 1313.1032 1321.0266 1341.4422 1353.0662 1360.9955 1371.1366 1384.0663 1406.2445 1416.3797 1431.2569 1438.6949 1445.3602 1452.4973 1458.6167 1460.9018 1462.2006 1470.4785 1470.9290 1476.2035 1477.7235 1485.4332 1486.5277 1487.6457 1520.1907 1568.2803 1578.0206 1622.5127 2847.4034 2848.7260 2866.4481 2950.7869 2968.1118 2989.2505 2996.3385 3015.3776 3018.7654 3021.3162 3024.8222 3031.1015 3050.8809 3055.2004 3063.3737 3077.3751 3082.1365 3099.6186 3125.4272 3134.8238 3149.3054 3163.6808
redmass: 3.5484 3.4206 3.2540 3.8770 4.0735 3.4709 4.2273 2.8228 3.3700 1.4184 1.7811 1.5653 3.0124 1.7717 2.5914 2.6057 2.6522 5.4443 2.0088 3.7480 2.6383 3.3603 3.0036 2.9129 3.5141 4.6604 3.8720 4.1121 4.0562 4.5304 3.6064 4.6960 3.1134 2.0477 1.5204 3.3003 3.1041 2.0735 2.7101 1.5314 1.6566 1.8512 2.4196 3.3123 1.3732 2.2338 1.3060 3.4316 2.1169 1.5245 2.6203 2.0863 2.2571 1.7439 1.9401 1.6896 2.2511 1.5133 1.4651 1.2885 1.4609 1.3448 1.4736 1.9503 1.5337 1.6095 2.1842 2.0269 1.7571 1.2789 1.5156 1.3293 1.3578 1.4838 1.8342 1.4111 1.4668 2.3306 4.4686 1.1404 2.4960 1.1614 1.4400 2.1150 1.0972 1.1333 1.1629 1.1075 1.1469 1.0528 1.1493 1.0663 1.3998 2.4317 6.0818 6.9788 8.0957 7.3233 1.0642 1.0601 1.0599 1.0663 1.0664 1.0619 1.0632 1.0852 1.0725 1.0920 1.0723 1.0605 1.1015 1.1004 1.0956 1.1010 1.1005 1.1048 1.0849 1.0891 1.0951 1.1001
irintensity: 0.2331 0.3940 1.8018 2.3623 0.1215 0.7740 1.9310 0.0472 2.8357 1.5649 1.0411 0.4741 3.9652 0.7042 4.1285 3.9291 4.1608 1.3347 5.3959 1.1370 4.5270 3.3460 5.8742 4.3396 7.5927 14.3416 0.7041 2.2512 0.0506 1.7344 2.5813 1.8297 4.9707 23.9265 80.9785 9.8173 1.8690 10.8466 2.6374 1.8474 1.9090 4.8158 11.8851 28.2956 1.4045 21.0099 0.2557 7.4046 6.2318 18.0181 8.7825 0.5219 10.4345 13.6814 11.4948 10.3160 22.8251 1.8684 3.8077 12.8609 8.9548 11.8197 18.1852 8.9228 41.0744 27.8061 8.7740 1.1595 11.5620 23.2264 6.9957 9.1488 3.7786 7.0374 23.9218 17.0185 5.7563 17.2334 73.7603 2.8011 41.9054 3.9302 1.8764 13.9233 5.2167 13.3080 11.2131 18.9656 26.0979 15.3514 2.8479 16.8916 45.4423 21.1143 16.1078 78.3442 304.2176 10.2644 51.4360 59.4596 302.1224 32.2611 13.6877 38.2176 10.3390 24.9836 37.9807 37.2413 34.7897 24.2833 57.9467 17.3119 23.2273 25.3784 50.1702 7.5599 0.1144 5.9796 29.4035 33.1991
temp: 298.150 k
press: 1.00000 atm
elementType: 8 7 7 6 6 6 6 6 6 6 6 6 6 6 6 6 6 6 6 6 1 1 1 1 1 1 1 1 1 1 1 1 1 1 1 1 1 1 1 1 1 1
symmnumber: 1
zpe: 933444.4 jmol-1
zpe.correction: 0.355530 hartree
zpe.thermalcorrener: 0.374556 hartree
zpe.thermalcorrenthalpy: 0.375500 hartree
zpe.thermalcorrgfe: 0.305640 hartree
zpe.sumelectzpe: -844.252930 hartree
zpe.sumelectthermal: -844.233904 hartree
zpe.sumelectthermalent: -844.232960 hartree
zpe.sumelectthermalfe: -844.302820 hartree
dipole: 0.0180 1.5785 0.9342
dipole: 1.8343
quadrupole: -97.1385 -123.9952 -122.4525
quadrupole: -2.1585 0.5679 -0.7374
quadrupole: 17.3902 -9.4664 -7.9238 -2.1585 0.5679 -0.7374
hfenergy: -844.6084603 hartree
pointgroup: C01 [X(C17H22N2O1)]
dipole: -0.0636853 -0.6265921 0.3523264 debye
polarizability: 235.5947124|-0.2786494|268.2148325|-9.8893574|0.0394688|119.2733418 unknown
InChI: InChI=1S/C17H22N2O/c1-18(2)11-6-12-19-15-9-4-3-7-13(15)14-8-5-10-16(20)17(14)19/h3-4,7,9H,5-6,8,10-12H2,1-2H3
charge 0 multiplicity 1
42 atoms
O  -0.254285 3.20802 -0.336503
N  -0.035588 0.187221 -0.377114
N  4.262748 -0.018215 -0.010145
C  -2.315786 0.137204 -0.007991
C  -1.193181 0.977701 -0.191699
C  -3.707231 0.67473 0.210329
C  -1.841816 -1.216934 -0.073583
C  -0.413008 -1.153128 -0.29674
C  -3.637484 2.122367 0.760573
C  1.349888 0.664048 -0.554835
C  -2.686594 3.005932 -0.083691
C  -1.263174 2.438544 -0.206832
C  2.064869 0.941954 0.786575
C  -2.47433 -2.486857 0.041285
C  0.376484 -2.324856 -0.404357
C  3.577203 1.164568 0.574705
C  -1.690675 -3.647344 -0.066159
C  -0.279072 -3.563732 -0.287555
C  4.389793 -1.141075 0.942417
C  5.567338 0.332217 -0.609812
H  -4.271264 0.67109 -0.747048
H  -4.273115 0.02505 0.905158
H  -4.647796 2.572969 0.776024
H  -3.274249 2.09551 1.806432
H  1.917165 -0.101166 -1.112401
H  1.323191 1.589402 -1.152203
H  -2.603699 4.026458 0.330322
H  -3.091283 3.108706 -1.113122
H  1.632393 1.848149 1.249873
H  1.888344 0.101316 1.484384
H  -3.55516 -2.557551 0.207772
H  4.044145 1.469435 1.546458
H  3.716885 2.011585 -0.124984
H  1.457176 -2.275122 -0.573643
H  -2.159514 -4.633792 0.019089
H  0.303668 -4.488525 -0.367063
H  3.396427 -1.453601 1.307504
H  5.019397 -0.887994 1.834026
H  4.850968 -2.006696 0.433651
H  5.428097 1.118497 -1.372819
H  5.998328 -0.555289 -1.107788
H  6.314999 0.702505 0.137409
