program: Gaussian 09
title: 000029122
version: EM64L-G09RevD.01
frameworkgroup: C1[X(C15H16N4)]
method: RPBEPBE
basis: SDD
operation: Freq
keyword: #pfreq=noraman
keyword: PBEPBE/SDD
title: #p freq=noraman PBEPBE/SDD
converged: YES YES NO NO
title: Mulliken charges:
elementType: N N N N C C C C C C C C C C C C C C C H H H H H H H H H H H H H H H H
charge: -0.411157 -0.416471 -0.694239 -0.025112 0.366408 -0.582150 0.120638 -0.347539 0.223921 -0.442740 -0.405808 -0.349533 0.370203 -0.257065 -0.213989 0.204428 -0.296929 -0.439448 -0.361522 0.225278 0.217406 0.220610 0.217130 0.278318 0.307776 0.229828 0.324089 0.228939 0.223013 0.224015 0.222021 0.220273 0.228302 0.294508 0.296600
chargesum: 0.00000
title: Mulliken charges with hydrogens summed into heavy atoms:
elementType: N N N N C C C C C C C C C C C C C C C
charge: -0.103381 -0.092382 -0.103131 -0.025112 0.366408 -0.139465 0.120638 0.090201 0.223921 -0.164422 -0.175981 -0.120595 0.370203 -0.034052 0.010026 0.204428 -0.074909 -0.219175 -0.133221
polarizability: 2.29630263e+02 1.29283876e+01 1.91397215e+02 -1.73774498e+01 8.91486184e+00 1.47572086e+02
1716.lowfreq: -5.6141 -0.0005 -0.0005 -0.0004 1.7606 7.8650 18.2591 21.8551 39.5015
frequency: 15.9841 21.1297 39.4073 70.2004 112.0877 144.6437 163.0355 183.0410 220.9772 257.3864 274.8041 281.6728 295.4635 310.5733 421.5882 428.9161 432.7882 457.7271 485.8819 511.5245 515.0540 524.9702 540.7321 569.6246 575.1471 578.6225 606.5088 623.7306 639.0918 694.8913 741.4805 749.5404 750.7662 767.0366 782.9329 801.7482 807.3026 829.4995 850.8372 867.0699 876.5116 909.6472 926.6048 932.8286 965.3994 973.2411 1012.3039 1019.4815 1040.3630 1059.1228 1078.6823 1097.2769 1117.8949 1136.5693 1168.0327 1180.4707 1200.3162 1223.7814 1236.0506 1243.9733 1258.5079 1290.6527 1302.5921 1326.4991 1336.3613 1350.6349 1356.6930 1366.3604 1391.5607 1421.0571 1422.0340 1450.3107 1458.4028 1462.0593 1483.4311 1493.3644 1510.1363 1560.3009 1570.6901 1587.3591 1591.4681 1632.2617 1643.9866 2939.0662 2978.9929 2993.8983 3045.9512 3095.3075 3124.6640 3125.2893 3132.3485 3146.3480 3160.8657 3164.1769 3216.3734 3476.5094 3514.2495 3612.5716 3615.1847
redmass: 5.6766 4.6042 4.9717 5.1640 4.6882 3.7734 3.5668 3.1571 4.0497 2.4268 3.3495 2.0697 1.9480 2.7646 2.9989 3.6228 2.8194 3.5591 3.2529 1.1895 1.2680 4.2737 4.9951 3.6743 2.4776 2.8610 2.8501 3.3292 3.0932 3.9760 4.0612 1.3835 4.0252 3.5986 3.1813 1.5348 1.3942 3.4346 1.5000 5.0923 1.4394 2.6901 1.4125 1.3905 2.2361 1.3084 2.1148 2.2898 2.1281 1.7091 2.8170 1.5713 2.6861 1.5802 1.1144 1.6853 1.3550 1.3544 1.9555 1.9378 1.5176 2.0124 2.1321 1.4602 1.7113 1.7472 1.9060 1.8590 4.7922 2.6168 2.3725 1.6630 4.1103 1.1208 2.9996 1.1242 3.6112 5.9498 4.8426 6.1292 4.7250 6.9176 1.1915 1.0598 1.0867 1.0747 1.1015 1.0903 1.0888 1.0850 1.0891 1.0953 1.0951 1.1002 1.0983 1.0471 1.0762 1.0810 1.0976
irintensity: 1.2714 1.0615 0.4081 0.8497 1.4329 1.1442 0.9261 6.4649 9.9535 1.5267 1.4792 25.1176 19.8915 8.3102 9.7887 4.2212 14.9846 4.1948 13.9049 106.9198 120.3022 9.7752 5.3072 21.7897 25.7059 19.5535 99.2769 46.0079 4.3717 0.0788 3.9405 112.1439 6.1664 8.0908 0.9491 26.8310 49.5528 30.9094 0.0616 0.3364 7.8472 9.6489 0.2282 4.0738 12.1680 0.0725 9.7904 4.3061 7.8006 11.5426 0.3442 35.1157 12.7474 2.3513 0.4484 16.3021 2.6508 15.4473 9.2951 10.2449 19.1974 1.4764 44.9072 24.3318 0.8739 2.6484 23.6019 11.7354 34.3503 1.5966 3.7917 98.6102 18.6674 9.9780 1.5346 79.1880 111.5657 10.0751 20.8229 0.8926 358.0597 3.0894 73.0388 56.1245 11.9955 76.4735 26.2146 43.6481 23.3464 1.4444 4.2253 35.0256 22.0672 26.2855 0.5065 5.5882 88.0835 60.9734 16.8783
temp: 298.150 k
press: 1.00000 atm
elementType: 7 7 7 7 6 6 6 6 6 6 6 6 6 6 6 6 6 6 6 1 1 1 1 1 1 1 1 1 1 1 1 1 1 1 1
symmnumber: 1
zpe: 747381.9 jmol-1
zpe.correction: 0.284663 hartree
zpe.thermalcorrener: 0.301092 hartree
zpe.thermalcorrenthalpy: 0.302036 hartree
zpe.thermalcorrgfe: 0.238702 hartree
zpe.sumelectzpe: -798.860226 hartree
zpe.sumelectthermal: -798.843796 hartree
zpe.sumelectthermalent: -798.842852 hartree
zpe.sumelectthermalfe: -798.906186 hartree
dipole: 6.1641 2.3883 1.7976
dipole: 6.8507
quadrupole: -143.2844 -89.1295 -111.2727
quadrupole: 7.9220 -6.7516 0.1982
quadrupole: -28.7222 25.4327 3.2895 7.9220 -6.7516 0.1982
hfenergy: -799.1448882 hartree
pointgroup: C01 [X(C15H16N4)]
dipole: 2.3398762 1.2834204 0.3772703 debye
polarizability: 228.6402718|9.2592597|193.4374327|-19.8530764|-7.5773647|146.5218586 unknown
InChI: InChI=1S/C15H16N4/c16-13-10-17-7-6-15(13)18-8-5-11-9-19-14-4-2-1-3-12(11)14/h1-4,6-7,9-10,18-19H,5,8,16H2
charge 0 multiplicity 1
35 atoms
N  2.596457 2.164171 0.465537
N  -1.273064 -0.146539 0.694345
N  -2.316787 1.873273 -0.926074
N  -5.225937 -0.509115 -0.855558
C  1.541155 0.354371 1.391948
C  0.62361 -0.481575 2.252463
C  2.47198 -0.116741 0.376531
C  -0.543919 -1.146659 1.470998
C  3.119906 1.040456 -0.186483
C  1.649562 1.746767 1.413786
C  2.830295 -1.404743 -0.105299
C  4.096981 0.943824 -1.202156
C  -2.542659 -0.322534 0.165132
C  3.804234 -1.508447 -1.116865
C  4.429643 -0.346808 -1.660528
C  -3.103253 0.721934 -0.652062
C  -3.343468 -1.476559 0.383094
C  -4.430907 0.57728 -1.108539
C  -4.656791 -1.519026 -0.135709
H  0.193931 0.150242 3.052764
H  1.193971 -1.288093 2.752675
H  -0.149602 -1.946095 0.807362
H  -1.220437 -1.635639 2.202305
H  1.135589 2.466808 2.049171
H  2.879291 3.127348 0.300318
H  2.361531 -2.306368 0.304619
H  -0.840617 0.775758 0.603921
H  4.583582 1.8321 -1.620521
H  4.090742 -2.495097 -1.497164
H  5.183519 -0.461186 -2.447328
H  -2.964725 -2.322803 0.963772
H  -4.883527 1.373308 -1.716409
H  -5.285662 -2.401036 0.033009
H  -1.366115 1.718779 -1.272725
H  -2.800009 2.654943 -1.370029
