program: Gaussian 09
title: 000029167
version: EM64L-G09RevD.01
frameworkgroup: C1[X(C18H23ClN2O)]
method: RPBEPBE
basis: SDD
operation: Freq
keyword: #p
keyword: freq=noraman
keyword: PBEPBE/SDD
title: #p freq=noraman PBEPBE/SDD
converged: YES YES NO NO
title: Mulliken charges:
elementType: Cl O N N C C C C C C C C C C C C C C C C C C H H H H H H H H H H H H H H H H H H H H H H H
charge: -0.074501 -0.256055 -0.193110 -0.099981 0.210861 0.051089 -0.517110 0.155052 0.220001 -0.442412 -0.411777 -0.498029 0.112245 -0.376615 -0.390951 -0.325538 -0.348521 -0.330046 -0.118380 -0.215766 -0.671589 -0.674104 0.229187 0.227419 0.265994 0.227604 0.220144 0.213415 0.233475 0.244115 0.214312 0.229753 0.263870 0.250559 0.256703 0.189087 0.208115 0.189895 0.253614 0.202809 0.224305 0.208899 0.205555 0.227612 0.208794
chargesum: 0.00000
title: Mulliken charges with hydrogens summed into heavy atoms:
elementType: Cl O N N C C C C C C C C C C C C C C C C C C
charge: -0.074501 -0.256055 -0.193110 -0.099981 0.210861 0.051089 -0.060504 0.155052 0.220001 0.051186 0.021782 -0.020439 0.112245 0.067450 -0.127081 -0.074979 0.097269 0.067964 -0.118380 0.037848 -0.035575 -0.032143
polarizability: 3.07070577e+02 -3.64454626e+01 2.67764916e+02 1.21346701e+01 6.08977554e+00 1.31855613e+02
1716.lowfreq: -9.3649 -4.8564 -0.2049 -0.0017 -0.0012 0.0014 16.6485 26.5284 34.0921
frequency: 16.4147 26.5056 34.0861 60.0323 63.9136 77.5473 83.8460 90.6682 117.4496 133.2222 155.4626 167.4794 197.3793 222.6076 238.2701 254.4734 262.2438 276.1156 295.4432 309.5057 314.5134 323.4046 364.2892 395.7972 408.3669 421.7478 431.1678 450.4230 465.8641 484.5143 535.6898 569.5958 576.3862 601.9387 620.5777 652.1422 666.5058 717.2107 745.9089 750.7288 774.3506 793.4548 799.9864 800.9402 804.2698 846.2688 857.9422 876.9200 896.6260 915.0969 937.6456 939.5875 990.2466 1002.2421 1033.1531 1045.6640 1051.8914 1052.9564 1062.4884 1072.3715 1079.1054 1084.1853 1101.3816 1122.8739 1139.6501 1141.2409 1169.1209 1188.4647 1208.9656 1220.4584 1237.3443 1250.7358 1259.7479 1278.7511 1285.8962 1294.0636 1303.8261 1315.0578 1325.2699 1335.7677 1349.2278 1362.7580 1367.1943 1380.1355 1384.0054 1385.4993 1391.2766 1400.6067 1428.0338 1442.0658 1447.2252 1459.5365 1461.3691 1463.5060 1468.3878 1470.6865 1473.8226 1474.4431 1480.6229 1482.9200 1489.2481 1494.4882 1520.7484 1561.4243 1575.9325 1616.0622 2856.1595 2868.5156 2910.7550 2953.4685 2968.7265 2978.2831 2981.7126 2992.2680 3023.8321 3032.0934 3035.1802 3036.7769 3039.5587 3054.8881 3066.7264 3069.9204 3074.3133 3088.8596 3089.3889 3112.3239 3148.9334 3164.3257 3174.2117
redmass: 3.4533 4.6640 4.5402 3.9856 5.1861 2.7985 2.1518 3.2511 4.9128 4.1423 2.4297 1.9390 1.6569 2.1886 1.9095 2.1570 5.5258 2.1011 3.5815 2.8843 3.5561 3.6362 3.6325 4.2873 4.1565 3.8294 3.2219 2.9986 2.7383 3.0042 5.2914 3.8780 4.0988 4.5715 4.0760 4.1165 5.7376 4.3739 2.6780 2.9697 1.6365 1.1638 1.7063 1.5061 1.6623 2.3777 1.7921 1.5021 2.3964 2.0196 3.3198 1.3505 2.2857 3.5437 3.1260 2.6073 2.1751 2.2039 1.9168 2.7071 1.8918 2.1440 2.5458 1.7886 1.3191 1.3507 1.8261 1.4895 2.2575 2.3922 1.5494 1.5764 1.7562 1.2600 1.3928 1.2708 1.2572 1.4080 1.4186 1.6293 1.6334 1.3896 1.8637 1.3235 1.2349 1.4207 1.2591 5.3583 2.9289 1.3905 1.8322 1.1406 1.1127 1.0656 1.6137 1.5541 1.0695 2.0983 1.0435 1.0729 1.0746 1.0859 6.2716 7.7623 8.7941 7.8734 1.0721 1.0714 1.0692 1.0664 1.0666 1.0358 1.0358 1.0623 1.0921 1.0861 1.0846 1.0789 1.0799 1.1015 1.0953 1.0979 1.0981 1.1003 1.1002 1.1031 1.0888 1.0930 1.0965
irintensity: 0.0691 0.1131 0.6776 1.0273 1.1443 0.5126 0.0893 2.9464 1.8713 1.2254 0.5132 1.8805 0.5856 0.3965 0.3012 2.2510 4.6888 1.0028 4.2356 1.5330 0.3255 0.7972 2.9015 2.1283 11.5461 6.1521 6.9436 3.7715 1.2725 11.0492 9.6604 1.8332 2.9802 4.7526 7.8513 22.2762 3.5243 8.1999 2.7768 5.2475 10.8649 3.4582 38.9683 31.4918 14.9491 28.8336 9.3081 17.6422 8.4368 0.4873 18.0101 0.2120 3.2865 18.2018 1.6919 5.2315 26.7533 7.2265 25.5901 28.5525 30.1589 3.0842 66.8109 7.6509 6.7091 1.2007 17.5324 19.3447 55.6176 12.4985 10.0438 0.0449 26.4561 15.3984 17.3001 48.5378 11.3592 3.7765 6.0745 4.8694 11.6668 2.4140 7.6480 2.6212 14.4236 4.0882 24.9190 128.1546 27.4207 5.9375 11.1556 11.7306 18.3801 3.8995 36.5891 56.5876 4.6529 59.5646 5.2670 15.9009 14.9832 6.8586 18.8964 4.7365 399.4937 0.9138 57.9146 138.7813 68.8310 28.6198 11.6963 27.2941 37.8643 35.4482 34.1617 2.3335 24.2763 9.9585 20.7779 53.5415 20.2303 70.5112 56.6387 24.7672 57.3368 2.8387 4.1775 1.7064 4.8166
temp: 298.150 k
press: 1.00000 atm
elementType: 17 8 7 7 6 6 6 6 6 6 6 6 6 6 6 6 6 6 6 6 6 6 1 1 1 1 1 1 1 1 1 1 1 1 1 1 1 1 1 1 1 1 1 1 1
symmnumber: 1
zpe: 981104.7 jmol-1
zpe.correction: 0.373683 hartree
zpe.thermalcorrener: 0.395564 hartree
zpe.thermalcorrenthalpy: 0.396508 hartree
zpe.thermalcorrgfe: 0.320673 hartree
zpe.sumelectzpe: -1342.867435 hartree
zpe.sumelectthermal: -1342.845554 hartree
zpe.sumelectthermalent: -1342.844610 hartree
zpe.sumelectthermalfe: -1342.920445 hartree
dipole: -0.4366 0.9699 0.9126
dipole: 1.4015
quadrupole: -150.0023 -128.7877 -140.2558
quadrupole: 16.8442 -2.6180 2.2457
quadrupole: -10.3204 10.8943 -0.5739 16.8442 -2.6180 2.2457
hfenergy: -1343.2411175 hartree
pointgroup: C01 [X(C18H23Cl1N2O1)]
dipole: 0.1487483 -0.4344269 0.3052478 debye
polarizability: 297.7075233|-37.2808751|274.4078393|-24.882192|13.104768|134.5757429 unknown
InChI: InChI=1S/C18H23ClN2O/c1-3-20(4-2)10-11-21-16-9-8-13(19)12-15(16)14-6-5-7-17(22)18(14)21/h8-9,12H,3-7,10-11H2,1-2H3
charge 0 multiplicity 1
45 atoms
Cl -5.187141 2.872337 0.759438
O  1.521364 -2.589248 -0.68319
N  -0.079316 -0.032801 -0.397856
N  3.561991 0.86747 0.210313
C  -1.903607 -1.372222 0.072692
C  -0.527301 -1.36589 -0.251721
C  -2.684882 -2.642204 0.292941
C  -2.322683 -0.00064 0.136059
C  -1.160775 0.811843 -0.152808
C  1.297678 0.410739 -0.694798
C  -1.723148 -3.801849 0.659401
C  -0.529796 -3.885115 -0.323753
C  0.271598 -2.579909 -0.431025
C  2.16366 0.561404 0.582459
C  -3.569931 0.624416 0.419445
C  -1.229774 2.22636 -0.163259
C  4.367265 -0.360341 -0.052756
C  4.232105 1.836436 1.114937
C  -3.607803 2.021182 0.401207
C  -2.468631 2.829006 0.116398
C  5.49685 -0.126305 -1.07343
C  3.743112 3.283402 0.912308
H  -3.441325 -2.5034 1.088882
H  -3.248275 -2.905556 -0.627736
H  1.765028 -0.331986 -1.358152
H  1.256245 1.375999 -1.228158
H  -1.337572 -3.643242 1.685289
H  -2.270419 -4.762899 0.660892
H  -0.902797 -4.128666 -1.341351
H  0.174519 -4.687204 -0.041151
H  1.756103 1.379273 1.204644
H  2.082882 -0.375991 1.180517
H  -4.466307 0.037981 0.640005
H  -0.354585 2.846861 -0.378639
H  3.684162 -1.138544 -0.439734
H  4.794433 -0.766519 0.898274
H  5.315078 1.798398 0.897569
H  4.116243 1.544979 2.189779
H  -2.566606 3.9184 0.119331
H  6.218139 0.637174 -0.727566
H  5.075577 0.216439 -2.034647
H  6.058071 -1.063537 -1.247025
H  2.66305 3.386882 1.127105
H  3.915591 3.598635 -0.1316
H  4.283231 3.974048 1.586769
