program: Gaussian 09
title: 000029116
version: EM64L-G09RevD.01
frameworkgroup: C1[X(C9H18O)]
method: RPBEPBE
basis: SDD
operation: Freq
keyword: #pfreq=noraman
keyword: PBEPBE/SDD
title: #p freq=noraman PBEPBE/SDD
converged: YES YES NO NO
title: Mulliken charges:
elementType: O C C C C C C C C C H H H H H H H H H H H H H H H H H H
charge: -0.480262 0.220869 -0.348272 -0.453574 -0.346034 -0.284136 -0.167062 -0.706706 -0.707739 -0.694720 0.202598 0.193547 0.192041 0.197756 0.194392 0.192557 0.234448 0.279871 0.210789 0.247599 0.197731 0.197944 0.248194 0.210753 0.210334 0.210333 0.214323 0.332426
chargesum: 0.00000
title: Mulliken charges with hydrogens summed into heavy atoms:
elementType: O C C C C C C C C C
charge: -0.147836 0.220869 0.047873 -0.063776 0.040914 -0.049688 0.112810 -0.050586 -0.050848 -0.059731
polarizability: 1.38215606e+02 -2.83342092e+00 8.64176288e+01 6.47811610e+00 8.88037634e-01 9.01351833e+01
1716.lowfreq: -4.3955 -0.0006 0.0006 0.0008 6.3176 17.4756 34.3672 61.8972 67.3572
frequency: 33.0752 61.7539 67.3549 88.6488 124.0251 184.8359 198.7432 222.3943 237.5029 251.9907 262.3275 268.9381 327.7203 340.5666 391.2647 420.8307 438.2741 493.0663 569.4495 726.0624 748.3891 783.8895 821.3207 885.5232 905.4531 908.1035 918.1343 939.4033 982.4873 995.2718 1004.9468 1043.2674 1070.1887 1097.6380 1106.8057 1129.2761 1171.0491 1175.4192 1208.2477 1241.2554 1265.6869 1277.1832 1286.8204 1297.9388 1320.3585 1346.7776 1351.4960 1369.4990 1388.7964 1389.6162 1454.4332 1458.8936 1460.1215 1465.9462 1470.8544 1476.8205 1478.3076 1479.6312 1487.0590 1689.4158 2949.4076 2962.2650 2968.9315 2971.7383 2972.4004 2972.9474 2999.3828 3011.3563 3040.5248 3059.3262 3066.4841 3069.5843 3069.9057 3079.5460 3094.5354 3098.5680 3116.2957 3559.6103
redmass: 2.8073 2.8071 2.0827 2.4256 2.3301 2.3867 2.4589 1.0567 1.1495 1.7517 1.1445 1.3038 2.6079 2.5575 2.8561 3.2045 2.5682 3.2406 3.1959 1.1060 3.0566 1.4160 1.6791 1.7414 1.5066 1.6068 2.4172 1.4612 1.1461 1.3086 2.8846 1.6811 2.5059 1.7686 1.9861 1.4692 2.3833 3.8424 1.5218 1.3133 1.2884 1.2215 1.1222 1.2459 1.4440 1.6913 1.7337 1.2051 1.2097 1.2154 1.0499 1.0786 1.0582 1.0732 1.0506 1.0714 1.0422 1.0795 1.0799 6.9092 1.0609 1.0583 1.0370 1.0480 1.0482 1.0374 1.0966 1.1003 1.1041 1.0978 1.0969 1.1007 1.0993 1.0910 1.0997 1.0994 1.0891 1.0659
irintensity: 1.6375 0.0447 0.3883 3.5767 0.8706 2.3367 1.2546 2.1064 1.8505 28.9090 90.7607 11.4982 3.4082 9.0301 1.1092 6.8690 0.4993 7.3917 6.3364 11.8303 10.4749 6.5281 1.0450 2.5074 0.0076 5.1786 4.3930 11.4399 50.9190 0.7493 10.8689 28.1100 2.1108 54.1868 29.9248 20.4828 20.9764 34.9988 7.4595 2.0341 1.5271 0.4479 0.6264 1.6656 4.6409 13.5650 19.5382 23.6304 7.5333 11.8440 0.6008 1.5683 3.9433 0.4895 7.9945 4.5675 12.6541 17.2525 17.6668 2.8424 24.9648 7.8082 15.6224 40.9624 94.2671 40.7158 7.0878 1.7292 55.4676 2.5323 65.0579 91.0702 54.4858 28.4849 18.2766 32.6434 10.6387 4.9474
temp: 298.150 k
press: 1.00000 atm
elementType: 8 6 6 6 6 6 6 6 6 6 1 1 1 1 1 1 1 1 1 1 1 1 1 1 1 1 1 1
symmnumber: 1
zpe: 652702.6 jmol-1
zpe.correction: 0.248601 hartree
zpe.thermalcorrener: 0.262076 hartree
zpe.thermalcorrenthalpy: 0.263020 hartree
zpe.thermalcorrgfe: 0.208431 hartree
zpe.sumelectzpe: -428.121807 hartree
zpe.sumelectthermal: -428.108332 hartree
zpe.sumelectthermalent: -428.107388 hartree
zpe.sumelectthermalfe: -428.161977 hartree
dipole: -1.3023 0.1545 -0.9767
dipole: 1.6352
quadrupole: -54.5705 -65.3133 -63.5375
quadrupole: -2.6833 0.3193 0.7330
quadrupole: 6.5699 -4.1729 -2.3970 -2.6833 0.3193 0.7330
hfenergy: -428.370408 hartree
pointgroup: C01 [X(C9H18O1)]
dipole: -0.5102405 0.1008152 -0.3786467 debye
polarizability: 138.159889|-3.3035766|86.2363579|6.4510665|0.460369|90.372171 unknown
InChI: InChI=1S/C9H18O/c1-4-5-6-7-8-9(2,3)10/h7-8,10H,4-6H2,1-3H3
charge 0 multiplicity 1
28 atoms
O  -2.439946 0.2917 1.417329
C  -2.504236 0.137958 -0.058761
C  2.432119 0.176029 0.16692
C  1.336718 -0.869181 -0.178297
C  3.851662 -0.288869 -0.230837
C  -1.115577 -0.280007 -0.516977
C  -0.0417 -0.456226 0.291828
C  -2.894529 1.496758 -0.696187
C  -3.539617 -0.960917 -0.411684
C  4.940761 0.753546 0.102443
H  2.195813 1.132102 -0.34209
H  2.406078 0.387597 1.255823
H  1.616962 -1.832162 0.30067
H  1.329316 -1.0491 -1.272101
H  3.870959 -0.512707 -1.317178
H  4.079274 -1.243405 0.286775
H  -1.022516 -0.443405 -1.601823
H  -0.175047 -0.28054 1.36803
H  -2.867307 1.443145 -1.800049
H  -2.189069 2.278526 -0.367112
H  -3.919633 1.793077 -0.397778
H  -4.559519 -0.655076 -0.105061
H  -3.279051 -1.898364 0.108311
H  -3.559424 -1.157873 -1.499311
H  4.960221 0.972499 1.186836
H  4.752352 1.70641 -0.427358
H  5.946374 0.397708 -0.188707
H  -3.337939 0.562378 1.737146
