program: Gaussian 09
title: 000029229
version: EM64L-G09RevD.01
frameworkgroup: C1[X(C9H15Br6O4P)]
method: RPBEPBE
basis: SDD
operation: Freq
keyword: #p
keyword: freq=noraman
keyword: PBEPBE/SDD
title: #p freq=noraman PBEPBE/SDD
converged: YES YES NO NO
title: Mulliken charges:
elementType: Br Br Br Br Br Br P O O O O C C C C C C C C C H H H H H H H H H H H H H H H
charge: 0.022864 0.010086 0.013131 0.030215 0.019015 0.027091 1.395472 -0.489593 -0.489920 -0.505753 -0.612325 0.061355 0.075441 0.077191 -0.682990 -0.698402 -0.707415 -0.679682 -0.703516 -0.678916 0.272361 0.287684 0.299323 0.321821 0.283192 0.339420 0.290401 0.290130 0.336979 0.298006 0.290847 0.289943 0.330571 0.293631 0.292339
chargesum: 0.00000
title: Mulliken charges with hydrogens summed into heavy atoms:
elementType: Br Br Br Br Br Br P O O O O C C C C C C C C C
charge: 0.022864 0.010086 0.013131 0.030215 0.019015 0.027091 1.395472 -0.489593 -0.489920 -0.505753 -0.612325 0.333716 0.363125 0.376514 -0.077977 -0.068582 -0.080305 -0.090829 -0.083002 -0.092947
polarizability: 2.56958851e+02 1.63381496e+01 2.04702513e+02 -3.78040721e+00 1.48734255e+01 2.10092562e+02
1716.lowfreq: -7.5352 -3.8277 -0.0002 0.0007 0.0008 3.0111 5.5548 6.6711 9.7600
frequency: -3.4281 6.1494 9.6282 16.3697 18.4764 21.2579 31.9915 39.9211 41.9669 47.2484 57.8782 70.3318 86.6771 99.8020 113.1028 128.4244 137.3506 152.8426 177.7405 179.9605 184.1015 195.2320 220.7076 258.1005 295.4175 301.6578 320.2609 346.7951 352.8213 360.9385 364.1167 396.7869 459.7298 479.3439 488.5937 563.6857 606.9189 628.9747 638.7311 646.3426 648.9804 681.1449 697.4834 714.6320 840.2678 841.0549 848.8117 857.8675 861.1037 868.7551 906.9504 918.7865 933.4682 994.1653 1000.1981 1003.9672 1022.2359 1058.8039 1081.8329 1083.1705 1117.6048 1119.9254 1158.3485 1190.9935 1192.8980 1195.0843 1213.8662 1240.0768 1240.5308 1250.5281 1252.0003 1256.8181 1302.8579 1308.8217 1311.4341 1330.3043 1346.4893 1348.5196 1422.1946 1422.4957 1422.8957 1439.7170 1452.0008 1454.1651 2987.3191 3038.3781 3041.0039 3051.6632 3054.8278 3057.5270 3060.1366 3060.5477 3065.5465 3136.8216 3143.0133 3147.0816 3147.2374 3148.8898 3157.4560
redmass: 33.1372 31.4307 33.7959 26.8232 41.2678 29.9287 28.2004 20.8414 15.8122 10.2055 11.0821 6.3273 8.6780 5.1176 9.1326 8.1890 4.7070 11.8732 3.8990 2.8143 4.6653 4.9733 6.6110 4.4771 6.0545 5.0709 3.6436 4.2748 4.4882 3.7019 5.0602 7.7536 5.2762 5.6267 5.3700 5.4436 5.5068 5.2492 4.4103 4.0559 4.1023 4.7434 3.9364 3.7071 2.6759 3.0723 2.0412 1.9046 1.9061 2.9068 1.9780 2.2110 2.5134 2.8061 2.2785 2.1443 11.9049 1.4931 2.5485 2.5370 1.1200 1.1324 1.1633 1.3344 1.3553 1.4722 1.2073 1.1452 1.1443 1.2048 1.2017 1.2340 1.2203 1.2042 1.2321 1.3814 1.3791 1.3811 1.1044 1.1047 1.0982 1.0932 1.0951 1.0962 1.0836 1.0867 1.0859 1.0576 1.0569 1.0566 1.0571 1.0573 1.0577 1.1100 1.1114 1.1096 1.1104 1.1112 1.1091
irintensity: 0.0506 0.0355 0.1202 0.0333 0.0996 0.1433 0.3407 0.3369 0.4999 2.2895 0.6253 2.4988 0.6134 3.9089 1.8140 2.7328 5.3411 4.0149 0.3377 1.9820 4.9964 0.6455 1.2404 6.9388 31.4738 23.1336 4.6285 8.7343 15.4197 5.8066 9.2482 14.6556 40.2897 17.4655 31.4480 17.2212 26.7171 14.9760 44.5001 29.2889 14.9813 39.7174 82.7330 62.5864 106.8512 241.2425 128.3774 67.0823 93.1429 188.9789 77.5659 230.2020 48.4229 94.9856 19.8273 25.1885 80.4000 2.5732 0.3961 0.7044 22.4705 15.0109 31.7776 3.7016 3.5143 1.5488 4.1459 14.0543 7.6815 11.9460 21.1541 36.8523 6.0687 10.7301 20.1414 9.7893 1.9819 0.6725 18.3600 16.1755 14.3293 25.1684 16.7259 14.5054 6.3862 2.9254 1.6544 12.5910 2.4237 2.1383 6.3302 8.3267 8.9212 1.3561 1.3617 1.1228 0.3065 2.8576 1.8219
temp: 298.150 k
press: 1.00000 atm
elementType: 35 35 35 35 35 35 15 8 8 8 8 6 6 6 6 6 6 6 6 6 1 1 1 1 1 1 1 1 1 1 1 1 1 1 1
symmnumber: 1
zpe: 626233.6 jmol-1
zpe.correction: 0.238520 hartree
zpe.thermalcorrener: 0.264483 hartree
zpe.thermalcorrenthalpy: 0.265427 hartree
zpe.thermalcorrgfe: 0.170143 hartree
zpe.sumelectzpe: -1073.219462 hartree
zpe.sumelectthermal: -1073.193499 hartree
zpe.sumelectthermalent: -1073.192555 hartree
zpe.sumelectthermalfe: -1073.287839 hartree
dipole: 0.2539 1.1305 -3.0728
dipole: 3.2840
quadrupole: -187.3567 -176.9488 -195.6792
quadrupole: -2.2123 -0.1787 -12.6884
quadrupole: -0.6951 9.7128 -9.0177 -2.2123 -0.1787 -12.6884
hfenergy: -1073.4579818 hartree
pointgroup: C01 [X(C9H15Br6O4P1)]
dipole: 0.1302928 -0.6236561 1.124017 debye
polarizability: 257.4637549|-15.6270919|199.833194|0.2195399|13.6665903|214.4569765 unknown
InChI: InChI=1S/C9H15Br6O4P/c10-1-7(2-11)17-20(16,18-8(3-12)4-13)19-9(5-14)6-15/h7-9H,1-6H2
charge 0 multiplicity 1
35 atoms
Br -0.4184 -4.325007 -1.600835
Br -3.965605 -1.272413 0.99191
Br 5.022549 0.887791 2.130576
Br 3.319466 0.93042 -2.674135
Br -3.422515 3.372105 1.351195
Br -1.669515 1.807764 -3.200602
P  0.230963 -0.190349 0.536384
O  -0.845188 -1.305123 -0.200296
O  1.740703 -0.631612 -0.148966
O  -0.090086 1.265821 -0.312321
O  0.17159 -0.130605 2.13029
C  -1.293704 -2.515007 0.54596
C  2.956566 0.20043 0.153956
C  -1.454322 1.895718 -0.263298
C  -1.873127 -3.443598 -0.519155
C  -2.281868 -2.162596 1.668977
C  3.509054 -0.300948 1.50327
C  3.907891 -0.042061 -1.01283
C  -1.552709 2.650018 1.078262
C  -1.502737 2.824609 -1.471572
H  -0.416972 -2.988599 1.035299
H  2.672682 1.266629 0.223653
H  -2.226246 1.106716 -0.326906
H  -2.491978 -2.886157 -1.235665
H  -2.4436 -4.265506 -0.060065
H  -1.831242 -1.449899 2.376253
H  -2.616307 -3.073257 2.190635
H  3.925649 -1.316958 1.43367
H  2.74215 -0.237776 2.290069
H  3.934158 -1.109312 -1.281029
H  4.914096 0.338167 -0.782251
H  -0.880168 3.520327 1.119643
H  -1.371206 1.974666 1.928319
H  -0.57456 3.410373 -1.555502
H  -2.385461 3.479129 -1.422492
