program: Gaussian 09
title: 000029143
version: EM64L-G09RevD.01
frameworkgroup: C1[X(C12H9N2O6P)]
method: RPBEPBE
basis: SDD
operation: Freq
keyword: #p
keyword: freq=noraman
keyword: PBEPBE/SDD
title: #p freq=noraman PBEPBE/SDD
converged: YES YES NO NO
title: Mulliken charges:
elementType: P O O O O O O N N C C C C C C C C C C C C H H H H H H H H H
charge: 1.111858 -0.675589 -0.601010 -0.197926 -0.194761 -0.191320 -0.198329 0.023185 0.023115 -0.120608 -0.133317 -0.418300 -0.370215 -0.218588 -0.278534 0.405769 0.393975 -0.183825 -0.171066 -0.353679 -0.353904 0.327074 0.306565 0.281904 0.297352 0.251792 0.252886 0.294792 0.294923 0.395782
chargesum: 0.00000
title: Mulliken charges with hydrogens summed into heavy atoms:
elementType: P O O O O O O N N C C C C C C C C C C C C
charge: 1.111858 -0.279807 -0.601010 -0.197926 -0.194761 -0.191320 -0.198329 0.023185 0.023115 -0.120608 -0.133317 -0.091227 -0.063650 0.063316 0.018818 0.405769 0.393975 0.067967 0.081820 -0.058887 -0.058981
polarizability: 2.33892426e+02 -3.66618716e+00 1.94139591e+02 1.96329737e+00 -2.85203438e+01 1.45862883e+02
1716.lowfreq: -10.6708 -7.2146 -3.8265 -0.0008 0.0008 0.0011 11.0750 20.0137 33.0208
frequency: 10.8688 19.6962 33.0172 53.1822 59.5421 88.2504 110.9428 135.8849 159.9843 176.2643 201.8065 209.0190 213.9547 228.2394 244.8019 279.4394 302.7505 349.9570 369.7808 393.5043 410.9544 418.2084 421.1842 451.5072 511.9113 513.9110 525.2279 531.5075 640.5464 645.0478 666.6236 682.1512 690.3173 699.4843 701.6014 710.2854 716.0079 815.3841 824.3605 826.1943 830.4206 930.9391 948.0061 964.5999 971.3550 983.6513 986.5425 989.2401 1008.9142 1014.3165 1023.1944 1070.5187 1080.0042 1087.9994 1091.4709 1118.1243 1125.6520 1176.0468 1181.4313 1215.9056 1217.2830 1280.1230 1285.6658 1374.6487 1376.1570 1388.9463 1393.4286 1421.1997 1424.0202 1456.3811 1460.3513 1583.3876 1586.8999 1600.4934 1603.4075 3145.6118 3155.6172 3165.3346 3165.7352 3172.0155 3173.7746 3186.6823 3187.4619 3600.7480
redmass: 9.4935 7.5082 7.5197 13.3330 9.8507 9.1571 9.7860 5.0235 5.6012 5.1596 8.4273 2.7314 4.6625 6.7923 7.8578 1.7293 5.8782 8.2080 6.9424 8.8177 7.5341 3.3305 3.5083 7.5354 6.8741 6.8702 6.1987 6.7040 7.5717 7.6562 9.6381 3.4005 4.1314 3.3604 3.4650 9.5237 10.4150 8.6359 2.2553 2.5560 1.5142 1.4619 1.4220 1.3997 1.3735 2.7892 5.8442 2.1643 1.3625 1.3635 3.6312 1.7660 1.7381 1.9853 2.0519 3.1622 3.1465 1.1526 1.1698 8.9743 8.6871 1.2933 1.2900 9.2255 9.2160 7.0126 7.6190 3.1342 3.0521 2.3916 2.3798 6.6017 6.6139 7.0525 7.0638 1.0899 1.0882 1.0931 1.0928 1.0935 1.0929 1.0972 1.0978 1.0663
irintensity: 2.5798 2.9203 0.6107 0.4823 0.8660 2.4743 2.0723 1.7567 1.4611 0.4210 3.6395 30.8150 13.2169 2.4943 19.3447 104.8380 0.2224 12.4069 49.1750 1.4348 6.5818 0.0183 4.3958 70.0681 14.1225 17.6985 39.3700 66.4963 10.4454 34.4798 70.1944 18.5909 39.5953 22.8255 60.0498 43.0883 15.1450 21.3511 52.8497 36.5556 14.7048 7.6536 7.2915 5.7582 2.4702 19.8498 2.8395 16.7998 0.6463 1.1427 91.7706 21.9469 48.9005 31.3830 13.9082 26.6547 33.2500 40.8413 25.7938 294.3332 156.9338 0.1076 1.7589 80.4757 96.7397 0.6396 6.6766 9.4810 68.4748 25.1867 15.0680 3.9476 10.3611 1.5441 1.2849 1.8717 3.4539 9.2297 5.6446 7.3922 1.4440 2.8090 2.8896 70.1580
temp: 298.150 k
press: 1.00000 atm
elementType: 15 8 8 8 8 8 8 7 7 6 6 6 6 6 6 6 6 6 6 6 6 1 1 1 1 1 1 1 1 1
symmnumber: 1
zpe: 521853.0 jmol-1
zpe.correction: 0.198763 hartree
zpe.thermalcorrener: 0.217888 hartree
zpe.thermalcorrenthalpy: 0.218832 hartree
zpe.thermalcorrgfe: 0.147836 hartree
zpe.sumelectzpe: -1363.082353 hartree
zpe.sumelectthermal: -1363.063228 hartree
zpe.sumelectthermalent: -1363.062284 hartree
zpe.sumelectthermalfe: -1363.133280 hartree
dipole: 2.7052 -0.2276 1.3939
dipole: 3.0517
quadrupole: -160.4968 -133.6629 -123.8457
quadrupole: 27.7955 -11.1991 -7.1655
quadrupole: -21.1616 5.6722 15.4895 27.7955 -11.1991 -7.1655
hfenergy: -1363.281116 hartree
pointgroup: C01 [X(C12H9N2O6P1)]
dipole: 1.0549301 -0.0249792 0.5726844 debye
polarizability: 233.58075|-4.2307091|183.1670511|2.7468158|-35.1923678|157.1470999 unknown
InChI: InChI=1S/C12H9N2O6P/c15-13(16)9-3-1-5-11(7-9)21(19,20)12-6-2-4-10(8-12)14(17)18/h1-8,19H
charge 0 multiplicity 1
30 atoms
P  -0.016069 1.574983 1.052553
O  0.42964 1.215126 2.703922
O  -0.464543 3.066606 0.683812
O  -5.4119 -1.029326 -1.306161
O  5.221681 -1.838381 -0.739118
O  -4.428194 0.948386 -1.876907
O  3.826514 -2.263716 1.014954
N  -4.480817 -0.143451 -1.193431
N  4.195416 -1.56745 -0.007018
C  -1.348517 0.293418 0.871681
C  1.494045 1.069559 0.073599
C  -2.373976 0.55933 -0.058655
C  2.255654 -0.063074 0.425185
C  -1.351168 -0.893157 1.642551
C  1.854527 1.874575 -1.033546
C  -3.392745 -0.402669 -0.210346
C  3.38123 -0.373644 -0.364944
C  -2.389855 -1.836157 1.46983
C  2.99029 1.538771 -1.805581
C  -3.419396 -1.600589 0.535062
C  3.763455 0.405711 -1.478453
H  -2.402759 1.488308 -0.637086
H  2.01367 -0.689811 1.288335
H  -0.569244 -1.059734 2.389554
H  1.251004 2.759387 -1.265872
H  -2.397011 -2.752849 2.067099
H  3.271682 2.160602 -2.660787
H  -4.234678 -2.311838 0.378193
H  4.645892 0.119477 -2.056935
H  0.986771 1.90861 3.13961
