program: Gaussian 09
title: 000029248
version: EM64L-G09RevD.01
frameworkgroup: C1[X(C20H26N2O2)]
method: RPBEPBE
basis: SDD
operation: Freq
keyword: #p
keyword: freq=noraman
keyword: PBEPBE/SDD
title: #p freq=noraman PBEPBE/SDD
converged: YES YES NO NO
title: Mulliken charges:
elementType: O O N N C C C C C C C C C C C C C C C C C C C C H H H H H H H H H H H H H H H H H H H H H H H H H H
charge: -0.325412 -0.265482 -0.346335 -0.082918 -0.053746 0.407348 0.349080 0.132594 -0.384879 -0.329960 -0.388305 -0.426130 -0.361384 -0.348398 -0.236427 -0.251545 -0.221727 -0.244469 -0.238382 -0.242233 -0.246821 -0.687359 -0.614850 -0.615846 0.248977 0.235630 0.337409 0.202512 0.197272 0.269530 0.280354 0.256256 0.269117 0.200797 0.231801 0.225582 0.222863 0.226079 0.225852 0.227571 0.225965 0.213064 0.232570 0.212043 0.232728 0.191579 0.221094 0.223683 0.188906 0.224350
chargesum: 0.00000
title: Mulliken charges with hydrogens summed into heavy atoms:
elementType: O O N N C C C C C C C C C C C C C C C C C C C C
charge: -0.325412 -0.265482 -0.008926 -0.082918 -0.053746 0.407348 0.349080 0.132594 0.099728 0.069824 -0.118774 -0.145776 -0.105127 -0.079281 0.196171 -0.025962 0.001136 -0.018390 -0.012530 -0.014662 -0.020856 -0.029682 0.030551 0.021094
polarizability: 2.50175072e+02 1.14587518e+01 2.41165142e+02 -6.44360746e+00 1.58241400e+01 2.07015941e+02
1716.lowfreq: -10.1194 -8.6766 0.0006 0.0007 0.0008 3.3652 11.4721 15.6649 24.3856
frequency: 10.3230 12.9533 24.3536 36.8614 40.6830 51.6150 60.9098 69.0617 87.0885 92.2095 110.5079 129.1332 150.0994 185.1931 209.8683 215.6008 219.6144 237.6111 239.6438 259.7002 268.1890 290.5021 297.0920 301.9971 333.9672 346.4032 374.5324 394.3317 401.3915 403.8558 425.0031 474.8024 488.0238 522.0453 592.6288 612.4012 616.6094 619.7827 661.8141 695.8972 703.8386 704.0915 712.8716 736.3938 765.2853 777.3060 816.6002 820.3124 821.1291 854.1497 859.3644 860.4675 912.7241 923.4258 935.6057 945.5865 970.2668 979.7523 985.2649 990.4095 992.0502 997.2592 998.3846 1019.3863 1027.8660 1030.2694 1035.8913 1037.3586 1054.7833 1072.0872 1083.5128 1086.9974 1089.7507 1093.5263 1110.2664 1139.5022 1140.0036 1170.1259 1173.0987 1176.8446 1178.1482 1190.3471 1196.9196 1209.4434 1228.3936 1251.9643 1260.3113 1268.0439 1301.8993 1315.8015 1324.7704 1332.4747 1368.5767 1377.0933 1377.3258 1381.6681 1394.9125 1420.8476 1433.1055 1434.9907 1442.3279 1452.8689 1461.4838 1461.9816 1468.5071 1474.4195 1475.4798 1477.3634 1479.2876 1482.9097 1483.7650 1486.1659 1496.2707 1588.6633 1591.1608 1606.6649 1610.3823 1613.4401 2849.1635 2854.9109 2870.7521 2960.2652 2989.8116 3013.0239 3017.6883 3017.8008 3032.3807 3032.6016 3076.3402 3086.3795 3088.2512 3093.3473 3096.7757 3122.5777 3123.3638 3132.9155 3133.7092 3145.5574 3147.2467 3159.5058 3160.4815 3174.4112 3176.8809 3497.5274
redmass: 3.4043 2.9052 4.5593 3.7543 4.0312 3.5606 4.0344 3.2669 3.9670 2.0609 4.2646 1.9853 5.3629 3.1955 2.3412 1.2842 1.7958 1.9382 1.6644 2.9179 3.1714 4.1474 4.5809 4.3609 4.2707 2.6451 5.6271 2.8589 2.8346 2.8518 2.7582 3.3814 3.8283 3.5975 6.8217 5.4232 6.3319 5.4802 5.2753 6.1535 1.6256 1.4221 1.3659 2.1119 1.8427 2.0660 1.1230 4.3318 1.7463 1.2901 2.3106 1.4339 2.5167 1.9221 3.1998 1.9631 4.0158 1.4296 1.4976 4.6112 4.5442 1.3833 1.3359 2.7939 2.2715 2.1772 1.6584 3.1829 2.8060 1.9921 1.6149 1.9880 1.3697 1.8764 2.2266 1.5272 1.4690 1.1334 1.0554 1.7842 2.1474 1.2818 1.1380 2.6710 3.4263 1.5957 1.1359 2.4400 1.1656 1.3306 1.3335 1.3487 1.2917 1.5793 3.9892 8.8429 1.2654 1.1414 2.2158 2.2245 1.1547 1.1037 1.0626 1.0467 1.0685 1.2750 1.1862 1.4970 1.0765 1.8965 1.6005 1.0892 1.1872 6.0387 6.3221 6.5786 6.1270 7.3361 1.0619 1.0618 1.0597 1.0610 1.0362 1.0888 1.0623 1.0701 1.0976 1.0766 1.1011 1.0993 1.1023 1.1011 1.1006 1.0848 1.0847 1.0885 1.0889 1.0939 1.0941 1.0984 1.0989 1.0966 1.0953 1.0769
irintensity: 0.3183 0.3551 0.5914 0.0565 0.0793 0.9049 0.0998 2.2012 1.0714 0.9118 2.6670 2.1926 7.3094 0.6500 0.7330 1.4349 1.1494 2.3417 0.0605 0.8777 1.0703 1.4085 12.1657 14.1257 4.0150 8.0593 3.2927 6.7247 0.0439 0.4211 8.7981 5.1029 8.2211 26.1363 7.0993 5.6713 0.1158 5.9661 13.0365 6.0844 60.3165 36.6517 99.4722 22.3896 38.0198 45.8313 3.4632 9.6399 5.0164 0.5896 5.9460 1.1570 18.0567 13.4607 9.0881 4.9986 48.8616 1.5796 0.2606 0.1744 0.4320 0.3669 0.6324 12.4831 15.9901 11.3799 11.9586 104.5750 30.3570 5.1729 1.5051 3.8977 7.0509 4.8198 4.7913 7.8213 6.2081 2.3273 0.0839 6.2836 3.7614 6.1701 10.0813 84.1893 23.5391 33.9568 2.3721 2.2903 4.0477 3.7207 2.5344 4.5950 5.4927 4.9011 1.7094 0.3334 26.3915 2.7204 22.2509 6.3002 0.1730 14.3711 48.2668 8.4458 5.2339 65.1788 6.8148 32.7918 22.6013 50.6506 40.6306 47.3516 63.6820 0.4054 1.0885 57.1309 18.9046 85.4984 83.2870 60.9883 186.6161 37.0784 24.1825 27.5844 11.7291 68.8127 40.8075 26.5856 32.2066 39.8242 37.2276 20.9579 33.5396 0.3781 0.1649 7.0699 14.1456 25.7099 24.9773 28.8617 25.2762 10.1862 8.6467 42.4985
temp: 298.150 k
press: 1.00000 atm
elementType: 8 8 7 7 6 6 6 6 6 6 6 6 6 6 6 6 6 6 6 6 6 6 6 6 1 1 1 1 1 1 1 1 1 1 1 1 1 1 1 1 1 1 1 1 1 1 1 1 1 1
symmnumber: 1
zpe: 1098303.2 jmol-1
zpe.correction: 0.418322 hartree
zpe.thermalcorrener: 0.443071 hartree
zpe.thermalcorrenthalpy: 0.444015 hartree
zpe.thermalcorrgfe: 0.359716 hartree
zpe.sumelectzpe: -1035.867468 hartree
zpe.sumelectthermal: -1035.842718 hartree
zpe.sumelectthermalent: -1035.841774 hartree
zpe.sumelectthermalfe: -1035.926073 hartree
dipole: -1.0515 -1.6209 2.6261
dipole: 3.2602
quadrupole: -131.4447 -135.3505 -141.4988
quadrupole: 4.1371 -1.2249 0.2111
quadrupole: 4.6533 0.7475 -5.4008 4.1371 -1.2249 0.2111
hfenergy: -1036.2857893 hartree
pointgroup: C01 [X(C20H26N2O2)]
dipole: 0.3921097 -0.737242 -0.9736501 debye
polarizability: 248.8012952|-12.0272903|240.523272|-5.6739038|-18.0112992|209.0315883 unknown
InChI: InChI=1S/C20H26N2O2/c1-4-24-20(17-11-7-5-8-12-17,18-13-9-6-10-14-18)19(23)21-15-16-22(2)3/h5-14,21H,4,15-16H2,1-3H3
charge 0 multiplicity 1
50 atoms
O  -0.4450 -0.237231 -1.698827
O  0.787127 0.145362 1.746792
N  1.708443 0.533721 -0.360366
N  5.399789 -0.03828 0.369937
C  -0.707632 0.056759 -0.256347
C  -1.619559 -1.021658 0.351965
C  -1.37035 1.451139 -0.224125
C  0.670475 0.217396 0.484731
C  3.060263 0.836197 0.124735
C  4.020063 -0.367226 -0.051001
C  -1.145043 -2.046917 1.206608
C  -1.598729 2.192518 -1.407098
C  -2.982359 -1.038587 -0.045535
C  -1.747308 1.999898 1.028146
C  -0.068083 -1.636439 -2.010126
C  -2.018113 -3.063256 1.657436
C  -2.20413 3.469087 -1.338053
C  -3.852373 -2.055875 0.398687
C  -2.348025 3.274676 1.093169
C  -3.372647 -3.074409 1.255754
C  -2.580198 4.015228 -0.090369
C  0.292488 -1.672254 -3.494916
C  5.551178 0.063447 1.837572
C  6.403886 -0.948158 -0.218678
H  2.964451 1.105732 1.190054
H  3.471198 1.703749 -0.422191
H  1.477894 0.586514 -1.357764
H  3.600086 -1.245504 0.503237
H  4.047934 -0.641937 -1.123454
H  -0.106566 -2.035465 1.547391
H  -1.312542 1.760607 -2.369356
H  -3.355208 -0.247779 -0.705951
H  -1.558931 1.428469 1.943715
H  0.791083 -1.945661 -1.377795
H  -0.919513 -2.30689 -1.788598
H  -1.639355 -3.843264 2.327581
H  -2.382255 4.03459 -2.260056
H  -4.901657 -2.052279 0.082665
H  -2.634562 3.689801 2.065948
H  -4.047447 -3.862364 1.609115
H  -3.048443 5.004833 -0.039125
H  0.551695 -2.70363 -3.796345
H  -0.560736 -1.334752 -4.10836
H  1.156098 -1.01952 -3.715527
H  4.86052 0.818454 2.248428
H  5.354366 -0.905102 2.363614
H  6.5804 0.383524 2.079031
H  7.418309 -0.602578 0.050608
H  6.302024 -2.009318 0.125125
H  6.321194 -0.935167 -1.320183
