program: Gaussian 09
title: 000029163
version: EM64L-G09RevD.01
frameworkgroup: C1[X(C17H22N2O2)]
method: RPBEPBE
basis: SDD
operation: Freq
keyword: #p
keyword: freq=noraman
keyword: PBEPBE/SDD
title: #p freq=noraman PBEPBE/SDD
converged: YES YES NO NO
title: Mulliken charges:
elementType: O O N N C C C C C C C C C C C C C C C C C H H H H H H H H H H H H H H H H H H H H H H
charge: -0.262434 -0.267738 -0.198976 -0.055489 0.206715 0.053468 -0.518808 0.172089 0.210592 -0.411553 -0.496831 -0.422768 0.100391 -0.425418 -0.573411 -0.323785 0.312316 -0.352872 -0.621704 -0.621919 -0.535920 0.222350 0.222872 0.208955 0.218615 0.241345 0.230916 0.215858 0.275063 0.252124 0.225907 0.250702 0.242442 0.250366 0.249148 0.191194 0.216470 0.225587 0.187093 0.223928 0.219359 0.219146 0.244617
chargesum: 0.00000
title: Mulliken charges with hydrogens summed into heavy atoms:
elementType: O O N N C C C C C C C C C C C C C C C C C
charge: -0.262434 -0.267738 -0.198976 -0.055489 0.206715 0.053468 -0.073586 0.172089 0.210592 0.016017 -0.024571 0.068153 0.100391 0.052614 -0.322709 -0.081343 0.312316 -0.102506 0.035108 0.014688 0.147203
polarizability: 3.07127906e+02 2.24780270e+01 2.47690297e+02 -1.00803213e+01 4.49177991e+00 1.19206569e+02
1716.lowfreq: -1.8153 -0.0009 -0.0001 0.0006 7.4983 9.6527 26.1330 31.4651 43.7154
frequency: 25.8364 31.4039 43.2666 58.7491 81.3042 101.7643 105.6903 124.2688 149.9001 152.4244 166.1637 209.4748 217.5904 226.0690 241.1235 249.2046 283.4003 285.3032 317.9206 331.1219 341.1979 393.8194 407.3903 412.4306 431.1331 434.9614 448.1823 469.3255 505.8318 548.8312 572.2847 597.1394 622.9834 627.8615 669.6432 706.0854 726.8105 750.3302 771.8207 807.6595 807.9325 818.3006 841.1805 858.0661 868.9035 896.6171 944.4568 949.8568 979.6664 994.0269 1004.2362 1040.1268 1046.9841 1051.5168 1054.9795 1059.8334 1092.5730 1098.7521 1113.0316 1132.5767 1136.4510 1137.4611 1155.1389 1166.6134 1184.2407 1192.1532 1233.3987 1237.7894 1255.0766 1281.6015 1292.5147 1302.5520 1311.8099 1318.8678 1334.3372 1339.0260 1348.8948 1362.6886 1383.0261 1408.8579 1424.6759 1430.8096 1431.9516 1436.9255 1443.4062 1453.4941 1456.1282 1458.2254 1461.9870 1464.4777 1469.9677 1470.4897 1474.7468 1479.2435 1484.4530 1493.1591 1499.2646 1517.4496 1570.6077 1574.0772 1628.5728 2847.2276 2872.9102 2948.3051 2952.7639 2967.4905 2982.1842 2989.3739 3003.3127 3010.4706 3016.9298 3023.2840 3037.4244 3051.0302 3051.3139 3062.7696 3065.0956 3085.1734 3103.7025 3122.8273 3145.1175 3157.7756 3171.6579
redmass: 3.7939 3.1224 3.7931 4.8507 3.3143 3.2706 2.8729 3.8879 3.0737 2.7560 3.4649 1.2157 1.9225 1.1082 3.1838 1.4301 2.8153 2.3314 6.0995 3.3789 3.2422 4.4470 3.6483 2.3510 2.7741 3.4622 4.7868 2.8359 4.3688 5.2029 3.9468 4.0543 3.6395 3.6887 4.9725 5.3807 3.2977 3.2395 1.5266 1.5552 3.3436 3.6732 1.6249 1.6712 2.6717 2.4629 1.3293 3.8093 5.6424 3.4114 3.9363 2.0738 1.5947 2.1113 1.9578 2.1791 1.2792 2.4051 1.2633 1.3393 1.2629 1.3843 1.4218 1.9083 1.6445 2.3494 2.2674 1.4638 2.1635 1.6780 2.8686 1.5812 1.3871 1.2837 1.6435 1.4945 1.6465 1.3942 2.1181 4.8764 1.1773 1.8496 1.3193 1.1208 1.6689 1.3179 1.0735 1.2507 1.1535 1.0506 1.2917 1.1093 1.0753 1.5937 1.0589 4.4226 1.0627 5.4923 7.6947 8.1371 7.2688 1.0577 1.0564 1.0658 1.0335 1.0663 1.0604 1.0628 1.0710 1.0752 1.0914 1.0643 1.1035 1.1012 1.0996 1.0958 1.1005 1.0992 1.1024 1.0989 1.0881 1.0911 1.0963
irintensity: 0.2464 0.9051 2.9402 0.1901 0.0944 5.5591 2.8364 0.6223 1.6987 2.0355 0.2669 1.7504 2.2551 0.9352 9.3183 1.5932 4.2740 2.3115 2.8231 0.2909 23.2342 3.9415 4.9322 0.5452 6.6905 2.7039 0.6711 0.8352 13.9729 3.8127 1.5770 2.8012 3.5219 9.3443 1.9846 5.0239 7.7763 2.1708 4.7169 41.0035 10.7484 13.6940 25.9045 7.2371 36.4187 7.9606 0.1413 5.5260 24.1504 38.1109 18.7883 6.1276 11.0954 0.6449 75.1551 33.9308 10.3396 24.6103 0.1307 4.5945 16.6177 2.3534 7.8853 61.7709 69.4718 139.8052 52.3155 5.5877 1.9566 9.5420 23.0757 53.6268 6.6088 0.0367 4.4631 4.2572 7.3144 5.9950 2.7614 99.1256 5.9492 26.6683 35.4925 2.3295 2.8045 7.2813 14.5035 20.7831 48.0081 12.1685 14.1721 13.2344 68.7551 86.9363 3.3676 122.5538 8.4879 10.9191 67.7523 312.8518 42.2103 96.6093 131.7612 29.5242 70.5045 13.8461 24.8169 35.5372 64.7129 69.7444 41.1990 29.8297 52.0037 66.9165 5.9006 22.3203 37.5447 31.2314 3.7889 30.8256 6.1647 10.9226 8.5997
temp: 298.150 k
press: 1.00000 atm
elementType: 8 8 7 7 6 6 6 6 6 6 6 6 6 6 6 6 6 6 6 6 6 1 1 1 1 1 1 1 1 1 1 1 1 1 1 1 1 1 1 1 1 1 1
symmnumber: 1
zpe: 941916.1 jmol-1
zpe.correction: 0.358757 hartree
zpe.thermalcorrener: 0.379299 hartree
zpe.thermalcorrenthalpy: 0.380243 hartree
zpe.thermalcorrgfe: 0.308785 hartree
zpe.sumelectzpe: -919.378463 hartree
zpe.sumelectthermal: -919.357921 hartree
zpe.sumelectthermalent: -919.356977 hartree
zpe.sumelectthermalfe: -919.428435 hartree
dipole: -3.0825 0.7523 -0.1187
dipole: 3.1752
quadrupole: -118.6718 -116.3942 -129.6650
quadrupole: -14.6270 -4.8189 3.9543
quadrupole: 2.9052 5.1828 -8.0880 -14.6270 -4.8189 3.9543
hfenergy: -919.7372201 hartree
pointgroup: C01 [X(C17H22N2O2)]
dipole: 1.1877732 -0.3859087 -0.0288661 debye
polarizability: 309.9149916|18.0348921|244.5101665|11.4335153|-6.8478118|119.5996143 unknown
InChI: InChI=1S/C17H22N2O2/c1-18(2)9-10-19-15-8-7-12(21-3)11-14(15)13-5-4-6-16(20)17(13)19/h7-8,11H,4-6,9-10H2,1-3H3
charge 0 multiplicity 1
43 atoms
O  -2.926864 -1.847128 -0.496701
O  4.732045 1.560171 0.083361
N  -0.655321 0.155523 -0.474253
N  -3.785525 2.11634 0.589297
C  0.754515 -1.621926 -0.036118
C  -0.590371 -1.241339 -0.268013
C  1.160276 -3.05157 0.215823
C  1.546153 -0.427627 -0.091842
C  0.639636 0.665267 -0.354817
C  -0.053448 -3.865161 0.734438
C  -1.30281 -3.655048 -0.156057
C  -1.8738 0.957751 -0.676338
C  -1.707917 -2.180885 -0.314544
C  -2.545639 1.33311 0.688085
C  2.941882 -0.176654 0.06464
C  1.108065 1.999165 -0.461767
C  3.390634 1.15045 -0.045125
C  2.480532 2.228276 -0.306288
C  -4.932287 1.411007 -0.010608
C  -3.629202 3.503235 0.12695
C  5.723109 0.51891 0.349841
H  1.53969 -3.512585 -0.72158
H  1.993185 -3.099857 0.943687
H  0.19832 -4.941781 0.773201
H  -0.28829 -3.545956 1.768584
H  -2.178919 -4.200441 0.237394
H  -1.106441 -4.055317 -1.173536
H  -1.599229 1.867535 -1.239812
H  -2.581594 0.364735 -1.275608
H  -2.771167 0.388903 1.217213
H  -1.817076 1.898285 1.302403
H  3.629532 -1.00435 0.260456
H  0.429601 2.835669 -0.656273
H  2.897204 3.237548 -0.377868
H  -4.981079 0.382292 0.385565
H  -4.892068 1.340404 -1.125713
H  -5.869173 1.935121 0.256705
H  -4.555959 4.068901 0.338278
H  -3.421232 3.607309 -0.968717
H  -2.803325 3.988441 0.679088
H  5.756014 -0.225198 -0.470708
H  5.516673 0.001608 1.307954
H  6.687369 1.044367 0.412723
