program: Gaussian 09
title: 000029165
version: EM64L-G09RevD.01
frameworkgroup: C1[X(C19H26N2O)]
method: RPBEPBE
basis: SDD
operation: Freq
keyword: #p
keyword: freq=noraman
keyword: PBEPBE/SDD
title: #p freq=noraman PBEPBE/SDD
converged: YES YES NO NO
title: Mulliken charges:
elementType: O N N C C C C C C C C C C C C C C C C C C C H H H H H H H H H H H H H H H H H H H H H H H H H H
charge: -0.263197 -0.192417 -0.100234 0.198576 0.051791 -0.518823 0.143629 0.218045 -0.411398 -0.441266 -0.497471 0.104197 -0.376872 -0.613803 -0.346839 0.457367 -0.352178 -0.348652 -0.329140 -0.825163 -0.672906 -0.675173 0.226595 0.223938 0.263524 0.225925 0.218086 0.209418 0.231256 0.241386 0.213456 0.229733 0.241679 0.242166 0.227836 0.187282 0.259404 0.188370 0.206889 0.227485 0.228644 0.223469 0.224426 0.201872 0.207946 0.227123 0.207252 0.206770
chargesum: 0.00000
title: Mulliken charges with hydrogens summed into heavy atoms:
elementType: O N N C C C C C C C C C C C C C C C C C C C
charge: -0.263197 -0.192417 -0.100234 0.198576 0.051791 -0.068291 0.143629 0.218045 0.016106 0.048183 -0.024830 0.104197 0.066317 -0.372124 -0.104673 0.457367 -0.124343 0.098033 0.066120 -0.145565 -0.038662 -0.034029
polarizability: 2.90662535e+02 -3.54682653e+01 2.82159497e+02 1.22831822e+01 4.30716712e+00 1.39142832e+02
1716.lowfreq: -9.6107 -7.1165 -0.0006 0.0005 0.0007 5.5591 19.4865 29.0399 36.8821
frequency: 19.2421 28.9569 36.8521 60.7066 68.2167 78.8578 80.6453 85.6245 92.3731 127.9075 147.3049 161.0719 179.9101 205.9112 227.9262 238.8164 255.3964 274.3119 290.8647 311.5837 313.6068 323.2413 336.5238 368.3174 404.7009 424.4414 434.2829 443.4733 460.3228 476.5817 492.8822 552.8448 569.5015 588.7068 608.3970 623.9083 669.1078 700.1859 729.8547 752.5558 765.0488 774.6636 795.4315 803.3883 804.8396 812.3322 853.5323 871.9101 886.3726 895.8833 915.5661 946.3610 947.6040 989.5244 995.7748 1012.7395 1034.4834 1045.7228 1048.0696 1053.4176 1062.8473 1073.5769 1078.9693 1084.1702 1097.2972 1121.9297 1136.2562 1145.2401 1170.9623 1186.3474 1190.7538 1209.4576 1224.4402 1237.1865 1255.3971 1264.2287 1282.3636 1293.8056 1298.3293 1304.7672 1312.0789 1325.2235 1337.2415 1349.6635 1361.8503 1369.1066 1381.3420 1383.2070 1386.6813 1389.5091 1398.2675 1400.2995 1428.9921 1442.2869 1450.9842 1458.9978 1461.8678 1463.4983 1466.4462 1469.6063 1471.3052 1471.9567 1473.5801 1479.9625 1482.9479 1488.5309 1495.3998 1499.7843 1521.0771 1566.7631 1574.3513 1632.7111 2853.2801 2867.3083 2908.6937 2949.8052 2967.8008 2972.1857 2978.3685 2978.7673 2989.0364 3020.1090 3030.2833 3034.3622 3037.4255 3039.8495 3048.1587 3050.5821 3062.6973 3070.0067 3071.9236 3081.3386 3087.8670 3089.0181 3113.4028 3119.9121 3127.3378 3149.0680
redmass: 3.4174 4.0367 4.2309 3.0435 3.3078 1.8203 1.5829 2.0537 3.1411 3.3253 2.8962 1.9864 2.2179 1.4580 2.3957 1.8035 2.0970 1.8689 3.2381 2.3520 3.5070 4.0333 3.3132 3.4327 3.2328 3.7381 3.0409 3.3421 3.0526 2.9781 3.3535 4.7876 3.8155 3.7895 3.8434 3.4869 5.4036 4.5063 2.7449 2.7279 3.1219 1.6084 1.1322 1.3010 1.4452 3.3147 1.5813 2.4335 1.4622 2.4290 1.9914 2.3921 1.3860 2.2794 2.0628 2.2398 3.0673 2.5383 1.5332 2.1983 1.9203 2.6763 1.9440 2.1247 2.2570 1.7524 1.2684 1.5053 1.6554 1.4935 2.4684 2.2836 2.4262 1.3509 2.0106 1.7126 1.1851 1.2162 1.2912 1.4505 1.3872 1.4290 1.7003 1.6593 1.3749 1.8319 1.2365 1.2353 1.5671 1.3416 1.6399 2.5525 2.4277 1.4829 1.5172 1.1626 1.0696 1.0755 1.3905 1.0480 1.8353 1.1696 1.0745 1.0447 1.0713 1.0742 1.0890 2.7989 5.3151 6.8416 7.9157 7.1780 1.0719 1.0714 1.0692 1.0662 1.0663 1.0373 1.0357 1.0357 1.0622 1.0919 1.0868 1.0841 1.0795 1.0793 1.0977 1.1013 1.0956 1.0983 1.0978 1.0983 1.1001 1.1003 1.1022 1.0879 1.0917 1.0963
irintensity: 0.1423 0.4545 1.5641 0.1874 0.2934 1.7973 0.1183 0.1767 1.9726 1.8944 1.0283 0.9141 2.8409 1.0208 0.9033 0.4782 1.5898 1.1193 8.5695 0.0801 0.6964 1.0770 2.5591 1.5393 7.2087 4.8708 6.1992 3.6363 2.4916 1.8876 9.7198 6.6100 2.3014 3.7222 5.9116 10.3016 1.8023 5.3670 2.1815 4.2303 1.3133 7.9783 5.4534 6.5241 41.8266 6.8866 0.5484 20.4097 7.0855 6.7807 0.5365 15.7194 1.5496 2.8181 3.7129 11.9019 4.9071 5.7355 10.9897 1.6211 35.2293 24.7237 30.4818 4.0394 44.0601 5.0056 7.5560 3.3541 16.5113 17.3880 11.4312 54.3382 7.9354 6.3819 0.7161 47.9530 14.3737 23.3476 7.1917 16.3856 5.7797 5.6404 7.0103 12.9876 1.5803 13.7328 5.3268 18.1117 6.0165 18.3401 10.6641 86.5549 37.7022 4.0319 11.1694 9.3280 10.0996 1.7126 24.3147 13.3760 43.6998 42.9941 2.0478 4.3821 10.3454 13.6846 8.2302 52.4687 12.0111 98.7628 345.3153 1.0730 64.4002 134.3265 69.5423 32.0334 13.6034 56.6847 38.6221 27.4666 37.2790 36.8838 9.9097 20.7081 11.0294 20.5829 22.5305 57.6130 22.3567 42.5912 81.3882 18.0493 38.2604 45.0982 4.1106 9.0067 19.5255 18.2527
temp: 298.150 k
press: 1.00000 atm
elementType: 8 7 7 6 6 6 6 6 6 6 6 6 6 6 6 6 6 6 6 6 6 6 1 1 1 1 1 1 1 1 1 1 1 1 1 1 1 1 1 1 1 1 1 1 1 1 1 1
symmnumber: 1
zpe: 1077303.1 jmol-1
zpe.correction: 0.410323 hartree
zpe.thermalcorrener: 0.432680 hartree
zpe.thermalcorrenthalpy: 0.433624 hartree
zpe.thermalcorrgfe: 0.357337 hartree
zpe.sumelectzpe: -922.706485 hartree
zpe.sumelectthermal: -922.684128 hartree
zpe.sumelectthermalent: -922.683184 hartree
zpe.sumelectthermalfe: -922.759471 hartree
dipole: 2.3313 -0.8913 1.1506
dipole: 2.7483
quadrupole: -123.9297 -124.9902 -135.1682
quadrupole: 7.3156 -1.5729 1.8651
quadrupole: 4.0997 3.0391 -7.1388 7.3156 -1.5729 1.8651
hfenergy: -923.1168082 hartree
pointgroup: C01 [X(C19H26N2O1)]
dipole: -0.9175746 0.2780678 0.4998645 debye
polarizability: 292.3973861|-33.741288|279.4179932|-18.6827268|7.9595461|140.1494846 unknown
InChI: InChI=1S/C19H26N2O/c1-4-20(5-2)11-12-21-17-10-9-14(3)13-16(17)15-7-6-8-18(22)19(15)21/h9-10,13H,4-8,11-12H2,1-3H3
charge 0 multiplicity 1
48 atoms
O  1.503124 -2.613297 -0.645619
N  -0.07228 -0.029382 -0.449055
N  3.572259 0.826768 0.205765
C  -1.918993 -1.332958 0.028037
C  -0.536309 -1.3539 -0.272982
C  -2.717494 -2.588655 0.268722
C  -2.325017 0.044079 0.046768
C  -1.150059 0.832766 -0.244551
C  -1.776238 -3.744304 0.694657
C  1.313976 0.390499 -0.730594
C  -0.565007 -3.873633 -0.260997
C  0.249979 -2.578694 -0.404582
C  2.161427 0.550199 0.557663
C  -3.566445 0.698168 0.290533
C  -1.209672 2.2468 -0.293551
C  -3.639525 2.101642 0.243595
C  -2.451242 2.856046 -0.050169
C  4.357106 -0.419785 -0.02905
C  4.245282 1.788621 1.115656
C  -4.946104 2.835609 0.495266
C  5.507767 -0.219959 -1.03362
C  3.785164 3.242958 0.897668
H  -3.491664 -2.418109 1.04118
H  -3.260903 -2.877155 -0.656659
H  1.782702 -0.36822 -1.374829
H  1.293883 1.348089 -1.278751
H  -1.408389 -3.55204 1.721449
H  -2.333561 -4.699643 0.720206
H  -0.919535 -4.154993 -1.275546
H  0.128368 -4.668673 0.066037
H  1.756658 1.385636 1.157672
H  2.055367 -0.374967 1.170666
H  -4.465145 0.109967 0.511291
H  -0.324095 2.852867 -0.510637
H  -2.522361 3.950591 -0.082352
H  4.76066 -0.822567 0.933826
H  3.665345 -1.189434 -0.4174
H  4.106845 1.505524 2.190344
H  5.330916 1.730202 0.916145
H  -4.857454 3.538784 1.345227
H  -5.251571 3.430474 -0.386698
H  -5.766022 2.133636 0.725505
H  5.108182 0.119869 -2.005109
H  6.237969 0.533625 -0.684609
H  6.053233 -1.169879 -1.187727
H  3.979319 3.548861 -0.145247
H  2.703809 3.365643 1.09418
H  4.326744 3.927925 1.576877
