program: Gaussian 09
title: 000029057
version: EM64L-G09RevD.01
frameworkgroup: C1[X(C11H8O4)]
method: RPBEPBE
basis: SDD
operation: Freq
keyword: #pfreq=noraman
keyword: PBEPBE/SDD
title: #p freq=noraman PBEPBE/SDD
converged: NO NO NO NO
title: Mulliken charges:
elementType: O O O O C C C C C C C C C C C H H H H H H H H
charge: -0.229222 -0.233908 -0.244921 -0.223328 0.189870 0.195033 0.147705 0.183147 -0.348765 -0.348406 -0.382842 -0.241390 -0.202697 0.178579 -0.500306 0.281758 0.294423 0.269307 0.239855 0.239843 0.241138 0.247560 0.247565
chargesum: 0.00000
title: Mulliken charges with hydrogens summed into heavy atoms:
elementType: O O O O C C C C C C C C C C C
charge: -0.229222 -0.233908 -0.244921 -0.223328 0.189870 0.195033 0.147705 0.183147 -0.067007 -0.079099 -0.088418 -0.001535 0.037146 0.178579 0.235957
polarizability: 1.91635025e+02 -1.40517268e+00 1.57311714e+02 1.67121777e-02 3.09088405e-03 5.57776904e+01
1716.lowfreq: -8.1891 -5.5796 0.0009 0.0009 0.0010 8.8724 42.8826 68.9151 95.1686
frequency: 42.8475 68.9101 95.1665 108.5267 126.5117 159.5138 185.3226 258.5005 267.6958 282.3054 300.8640 373.9771 426.3602 492.6567 500.3208 503.0879 532.3898 577.1553 589.8965 667.7741 706.7638 733.1462 744.0150 762.8591 788.0233 832.9202 861.2513 887.4561 916.4455 942.5412 976.3416 1004.1258 1018.8836 1050.7801 1073.0789 1115.5449 1123.2966 1151.7789 1163.5309 1196.3009 1221.6601 1242.7195 1287.0336 1343.3197 1399.4615 1424.6479 1446.2719 1452.6402 1460.7322 1461.9796 1552.7403 1569.3704 1611.9346 1616.5793 1620.8893 3004.9094 3105.8015 3140.5458 3152.0178 3155.5601 3166.7301 3178.2931 3186.5395
redmass: 5.4300 4.5474 1.1509 4.6070 4.9585 4.8374 4.9840 4.9442 6.0959 10.1676 5.2093 8.5660 3.4908 7.5618 10.4493 5.0170 5.2532 7.5672 6.4433 3.3896 5.9769 7.7873 5.7538 2.5810 1.5573 6.2979 8.4126 1.4279 1.5020 6.2167 1.3689 1.3335 2.4706 4.4604 3.3262 1.2648 1.6534 1.4724 1.2500 2.3083 3.3772 1.8534 1.9357 4.4485 9.2112 1.2065 2.6390 1.0488 2.5682 1.0687 10.7786 7.2087 8.1585 9.3623 7.3980 1.0300 1.1044 1.0863 1.0906 1.1047 1.0960 1.0994 1.0926
irintensity: 0.6176 1.2940 0.0110 0.8922 0.4332 0.0557 13.2786 4.9475 0.8068 6.2877 4.2588 19.3748 4.8285 4.0458 0.6619 4.4396 0.2777 4.0000 8.9536 5.1753 0.8356 10.4501 5.5779 38.6144 61.1173 20.9653 27.1922 0.0249 25.4360 21.0069 2.7430 0.0873 3.8580 97.6206 1.1142 0.0116 62.1065 39.5203 1.6245 17.1187 315.0600 0.7906 39.4903 177.8376 17.0923 11.3239 69.4941 16.1280 2.0890 9.2647 174.1526 2.1297 134.9672 46.8485 108.0143 29.8868 22.6386 3.8530 2.8005 12.3534 12.9406 11.0996 3.2753
temp: 298.150 k
press: 1.00000 atm
elementType: 8 8 8 8 6 6 6 6 6 6 6 6 6 6 6 1 1 1 1 1 1 1 1
symmnumber: 1
zpe: 433115.4 jmol-1
zpe.correction: 0.164965 hartree
zpe.thermalcorrener: 0.177702 hartree
zpe.thermalcorrenthalpy: 0.178646 hartree
zpe.thermalcorrgfe: 0.124957 hartree
zpe.sumelectzpe: -723.797484 hartree
zpe.sumelectthermal: -723.784747 hartree
zpe.sumelectthermalent: -723.783803 hartree
zpe.sumelectthermalfe: -723.837492 hartree
dipole: -0.4350 -5.3227 -0.0004
dipole: 5.3404
quadrupole: -67.1448 -92.5863 -86.9171
quadrupole: -0.8915 0.0007 -0.0042
quadrupole: 15.0713 -10.3703 -4.7010 -0.8915 0.0007 -0.0042
hfenergy: -723.9624489 hartree
pointgroup: C01 [X(C11H8O4)]
dipole: -0.0723439 2.0998327 0.0001397 debye
dipolederiv: -1.0872348 -0.3952811 0.0001533 -0.1959911 -0.708684 0.0000045 0.0002576 0.0000101 -0.1224063 -0.580789 0.2815786 0.0000128 0.0617295 -1.0545251 0.0000153 0.0000856 -0.0002297 -0.3489369 -0.9491921 0.3743531 -0.0000869 0.7143508 -1.0760971 -0.0000111 -0.0002655 0.0002538 -0.2767404 -0.9106786 -0.2194242 0.0001657 -0.0165908 -0.7221681 0.0001607 -0.0001174 -0.00026 -0.3069797 -0.245442 -0.2486884 0.0000208 -0.1970736 -0.5262292 -0.000011 0.0000713 0.0000342 -0.0150847 0.817632 0.1344477 -0.00014 0.194369 0.2365933 -0.0000522 -0.0001062 -0.0000009 0.1104447 1.043579 -0.2782736 -0.0001133 0.1280355 1.2291904 0.0000294 -0.0002234 0.0001996 0.1889484 0.0531632 0.3322508 -0.0000164 0.4797759 0.7720356 -0.0000485 0.0000722 0.0000096 0.0975321 0.0229768 0.1042949 -0.000021 -0.1274147 0.0905438 0.0000291 -0.0000302 -0.000009 -0.1018302 -0.2660187 -0.0777544 0.0000117 -0.1651371 0.0348828 0.0000578 0.0000104 0.0000202 -0.1637623 -0.5240304 0.4347398 0.0000462 -0.0488229 -0.2430426 -0.0000023 0.0001048 -0.0001217 -0.138416 0.1394015 -0.0514096 -0.0000755 -0.0319591 -0.250835 -0.0000029 -0.0000735 0.0000147 -0.1592782 0.0672905 -0.0346344 -0.0000557 0.0583273 0.1994733 0.0000043 -0.0000435 0.0000248 -0.1332372 1.6438353 -0.178628 -0.0001579 -0.6116887 1.4701062 -0.000114 -0.0000164 0.0001451 0.2434769 0.6367328 -0.2492301 0.0000891 -0.2156668 0.3387617 -0.0000243 0.0001148 -0.0000893 0.2760264 0.0924261 0.0043558 0.0000141 0.0864301 0.0298647 -0.0000215 0.0000263 -0.0000075 0.1563521 0.0741733 -0.031556 0.0000143 -0.0640436 0.0985001 0.0000087 0.0000229 -0.0000169 0.1613102 0.0653504 0.0786001 0.0000307 0.0415556 0.0147517 -0.0000179 0.0000143 -0.0000245 0.178618 -0.1130075 -0.0054899 0.0000605 -0.001939 0.0879474 -0.0000053 0.0000613 -0.0000084 0.1648699 0.0326429 -0.0913521 0.0000212 -0.0939112 -0.0466902 0.0000103 0.0000293 0.0000127 0.1577647 0.0643405 0.0030557 -0.0000086 0.0697939 -0.1024331 0.0000504 -0.0000354 0.0000562 0.1253705 -0.0386209 0.0570121 0.0423209 -0.0320839 0.0640629 0.0901885 0.0748223 0.0470272 -0.0470174 -0.0385302 0.0570333 -0.042286 -0.0320449 0.0639904 -0.0902477 -0.0747815 -0.0470404 -0.0470247 unknown
polarizability: 191.6911099|-0.2152751|157.2556287|-0.0165481|0.0038743|55.7776904 unknown
InChI: InChI=1S/C11H8O4/c1-14-11(13)10-6-8(12)7-4-2-3-5-9(7)15-10/h2-6H,1H3
charge 0 multiplicity 1
23 atoms
O  -0.450335 0.853274 0.000486
O  1.33358 -2.944366 -0.000334
O  -3.036367 1.23122 0.000472
O  -3.515183 -1.053311 0.000212
C  1.603389 -0.528148 -0.000034
C  0.956079 0.737446 0.00018
C  0.804336 -1.78507 0.000176
C  -1.205066 -0.316907 0.000547
C  3.023267 -0.553492 -0.000373
C  1.677388 1.950207 0.000069
C  -0.650803 -1.57474 0.000349
C  3.759467 0.642639 -0.00048
C  3.083208 1.894851 -0.00026
C  -2.688952 -0.109411 0.000835
C  -4.493408 1.505616 -0.000043
H  3.508994 -1.53521 -0.00053
H  -1.316081 -2.442148 0.000368
H  1.131794 2.897996 0.000233
H  4.85383 0.615135 -0.000729
H  3.658254 2.827016 -0.00035
H  -4.570262 2.601287 -0.000296
H  -4.963442 1.070792 0.898348
H  -4.962885 1.070423 -0.898547
