program: Gaussian 09
title: 000029060
version: EM64L-G09RevD.01
frameworkgroup: C1[X(C8H16O)]
method: RPBEPBE
basis: SDD
operation: Freq
keyword: #pfreq=noraman
keyword: PBEPBE/SDD
title: #p freq=noraman PBEPBE/SDD
converged: YES YES NO NO
title: Mulliken charges:
elementType: O C C C C C C C C H H H H H H H H H H H H H H H H
charge: -0.454133 -0.342135 -0.369147 -0.356038 -0.451131 -0.693615 -0.156817 -0.175923 -0.394811 0.189861 0.185753 0.206510 0.190618 0.194122 0.196144 0.199593 0.208294 0.209832 0.215501 0.210114 0.220029 0.238752 0.191490 0.197192 0.339947
chargesum: 0.00000
title: Mulliken charges with hydrogens summed into heavy atoms:
elementType: O C C C C C C C C
charge: -0.114186 0.033479 0.027981 0.034227 -0.043244 -0.058168 0.063212 0.062828 -0.006129
polarizability: 1.33148086e+02 -3.06549472e+00 7.49035544e+01 7.78187047e+00 2.05383084e+00 7.46894645e+01
1716.lowfreq: -14.2618 -2.7145 -0.0007 0.0002 0.0002 14.1930 28.4552 48.4279 65.2147
frequency: 28.2198 48.2552 65.2063 91.3118 117.3557 128.5467 157.8208 228.4418 237.1302 260.8355 292.5727 326.5031 404.1438 502.2893 514.2252 722.4823 745.1618 784.1811 842.8376 887.1680 926.7407 947.4541 956.3461 987.5274 1000.2260 1032.2789 1045.9065 1075.7661 1085.4541 1109.6021 1145.4310 1184.2138 1196.4208 1224.4907 1235.6154 1251.6261 1279.0075 1280.4091 1286.2183 1293.5678 1311.7411 1338.9363 1350.8643 1388.5331 1401.6747 1456.9219 1463.0948 1466.9168 1469.3690 1476.6873 1479.2710 1487.1755 1692.2527 2924.0506 2952.4687 2953.7758 2962.9046 2970.0718 2972.3096 2984.8747 2991.9657 3009.1039 3023.8784 3042.7204 3066.2789 3069.3382 3070.9954 3109.7239 3552.5310
redmass: 4.0286 2.2622 3.1869 2.2481 2.8102 2.1300 3.2003 1.1195 1.1359 2.8935 1.9813 2.8913 3.1213 2.7456 3.7967 1.0689 1.1527 1.4080 1.3225 1.8960 2.3284 2.0704 1.6981 1.1083 3.5648 2.0189 1.8982 2.3748 2.3515 2.1469 1.8747 1.1609 1.5095 1.2792 1.2750 1.2299 1.1398 1.2419 1.1116 1.2302 1.2916 1.4510 1.6439 1.2157 1.4218 1.0853 1.0705 1.0914 1.0756 1.0454 1.0735 1.0845 6.6144 1.0580 1.0605 1.0601 1.0602 1.0593 1.0368 1.1026 1.0972 1.0980 1.1013 1.1027 1.0925 1.1005 1.0993 1.0902 1.0664
irintensity: 0.7357 0.8102 3.9142 0.3787 1.0672 1.1410 2.5899 0.0758 152.7406 1.9821 9.2115 3.2880 6.0538 0.2141 6.1044 11.0961 0.2767 1.9348 7.8125 0.4288 78.6796 13.6351 10.4264 62.3983 0.8461 2.1261 13.2926 1.8144 18.4608 14.0692 0.7040 23.3084 6.9649 11.1692 10.4910 2.1867 0.4273 2.3885 0.9989 0.1759 1.4812 0.2434 0.9543 11.0425 11.8601 3.2122 0.2003 2.9358 1.8384 11.9256 4.7610 20.4925 11.6318 71.1906 1.3891 18.1792 1.3804 129.2435 34.3177 56.5027 2.0116 3.1648 4.7177 71.4065 28.0120 111.5978 54.5742 26.9890 4.1350
temp: 298.150 k
press: 1.00000 atm
elementType: 8 6 6 6 6 6 6 6 6 1 1 1 1 1 1 1 1 1 1 1 1 1 1 1 1
symmnumber: 1
zpe: 582398.5 jmol-1
zpe.correction: 0.221824 hartree
zpe.thermalcorrener: 0.233990 hartree
zpe.thermalcorrenthalpy: 0.234934 hartree
zpe.thermalcorrgfe: 0.182276 hartree
zpe.sumelectzpe: -388.885448 hartree
zpe.sumelectthermal: -388.873282 hartree
zpe.sumelectthermalent: -388.872338 hartree
zpe.sumelectthermalfe: -388.924996 hartree
dipole: 0.2761 1.9123 -0.1659
dipole: 1.9392
quadrupole: -53.1673 -58.9450 -56.4647
quadrupole: -9.9982 1.9169 0.9914
quadrupole: 3.0250 -2.7527 -0.2724 -9.9982 1.9169 0.9914
hfenergy: -389.1072721 hartree
pointgroup: C01 [X(C8H16O1)]
dipole: 0.1132575 0.7481363 0.0977581 debye
dipolederiv: -0.707469 -0.2775634 -0.0601785 -0.4090816 -0.3429605 0.0137511 -0.0236767 0.0296849 -0.5803356 -0.0549236 -0.0121793 0.0179589 -0.097029 0.0859743 -0.0297894 -0.0050347 -0.0248121 0.1769206 -0.0029924 0.0098353 0.0152429 0.0987486 0.0684799 0.0037101 0.0678228 -0.0194171 0.1883696 0.0095622 0.0012899 0.0118444 0.0713782 0.1027693 -0.0106931 0.0285801 -0.0133603 0.1714441 -0.1698542 0.0297805 0.0129251 0.0178168 0.1307693 -0.0502479 -0.0313782 -0.0267778 0.1378593 -0.0865778 0.0325911 0.0212439 -0.0173492 0.0612872 -0.0100662 0.0138976 -0.0108622 0.091904 0.195944 -0.133355 0.0471263 -0.3067212 -0.1358799 0.0985267 0.0177911 0.119088 0.0935626 -0.2512614 -0.0802087 0.0204526 -0.0222996 -0.1769403 0.1378782 0.0116223 0.1154694 0.0536814 0.8181296 0.1854668 0.1068647 0.2534929 0.4074693 -0.0420411 -0.061372 -0.020678 0.3816373 0.0375691 -0.0114674 -0.0075528 0.0014907 0.0029481 -0.0963281 0.0069548 -0.1209619 -0.1408291 0.0298378 0.0193404 -0.0159345 0.0275533 -0.1016957 0.1146383 -0.0217297 0.1411479 -0.0365988 0.041263 0.015928 -0.0135725 0.0102942 -0.0891787 0.1031083 -0.011852 0.1280104 -0.0275943 0.0487044 -0.0093665 0.0024346 0.0035133 0.0068688 -0.091401 0.0012403 -0.1190188 -0.1426353 0.0304954 0.0095113 0.0277205 -0.0076872 0.0073264 -0.0997647 0.001342 -0.132676 -0.1480154 0.0219424 0.0521439 -0.0363209 0.0189872 -0.0977828 0.1157266 -0.0214672 0.144402 -0.0303542 -0.003533 0.0677372 -0.0473878 0.0694922 -0.0744628 0.1064545 -0.0000905 0.125579 -0.0056666 0.0299496 -0.0138579 -0.0177178 -0.00686 0.028127 -0.0671614 0.0150922 -0.114118 -0.1253556 0.0708951 0.0220869 -0.0002752 0.0797198 -0.0656154 0.1232365 -0.040538 0.1393693 -0.0333032 -0.1620538 -0.1135066 -0.0016933 -0.152642 -0.0208015 -0.01041 -0.0059341 -0.0136764 0.097458 0.076215 0.0010435 -0.0251272 0.0413414 0.0366977 -0.102049 0.034144 -0.1101256 -0.1398595 0.0493591 0.0424708 0.0101722 0.0792514 0.0844798 -0.1113526 0.0292356 -0.10494 -0.095528 0.0772442 0.0491553 0.0228723 0.0983262 0.0844159 -0.104846 0.00858 -0.0963267 -0.065153 -0.1338926 0.0350036 -0.0545835 0.0058332 -0.1464992 0.1106938 -0.038757 0.1562316 -0.0309371 0.0001586 -0.0574548 -0.0387972 -0.0402202 -0.0111006 -0.0802064 0.0017144 -0.1349125 -0.1780061 0.0352881 0.1355753 0.0022829 0.1826505 0.1553046 -0.0213675 0.0238127 -0.0363191 0.387335 unknown
polarizability: 133.1505156|-4.9934973|74.0844772|6.7104104|1.8901768|75.5061119 unknown
InChI: InChI=1S/C8H16O/c1-2-3-4-5-6-7-8-9/h6-7,9H,2-5,8H2,1H3
charge 0 multiplicity 1
25 atoms
O  -4.84226 -0.322761 -0.153775
C  2.500173 -0.387709 -0.061677
C  1.139189 0.288398 0.218265
C  3.694941 0.589866 0.020623
C  -0.054588 -0.700201 0.125373
C  5.052443 -0.093949 -0.251891
C  -1.380501 -0.063954 0.480427
C  -2.461764 0.007263 -0.337739
C  -3.760812 0.675169 0.022591
H  2.478839 -0.854981 -1.068511
H  2.654413 -1.215891 0.661601
H  0.979815 1.119053 -0.498243
H  1.157733 0.746136 1.22934
H  3.711886 1.060043 1.025232
H  3.541655 1.414176 -0.705414
H  0.141813 -1.546417 0.818076
H  -0.103574 -1.128934 -0.894607
H  5.242157 -0.902445 0.479186
H  5.889535 0.625246 -0.185245
H  5.073748 -0.544566 -1.262194
H  -1.448716 0.374452 1.49017
H  -2.425693 -0.436336 -1.343014
H  -3.938771 1.543198 -0.65155
H  -3.726813 1.044065 1.069544
H  -5.717549 0.141479 -0.122166
