program: Gaussian 09
title: 000029049
version: EM64L-G09RevD.01
frameworkgroup: C1[X(C7H5N3O4)]
method: RPBEPBE
basis: SDD
operation: Freq
keyword: #pfreq=noraman
keyword: PBEPBE/SDD
title: #p freq=noraman PBEPBE/SDD
converged: NO NO NO NO
title: Mulliken charges:
elementType: O O O O N N N C C C C C C C H H H H H
charge: -0.105684 -0.170995 -0.206741 -0.163740 -0.057799 0.018646 0.013453 -0.086394 0.206879 0.327015 0.429778 -0.367640 -0.352836 -0.773233 0.280395 0.254835 0.267653 0.218637 0.267769
chargesum: 0.00000
title: Mulliken charges with hydrogens summed into heavy atoms:
elementType: O O O O N N N C C C C C C C
charge: -0.105684 -0.170995 -0.206741 -0.163740 -0.057799 0.018646 0.013453 -0.086394 0.206879 0.327015 0.429778 -0.087245 -0.098001 -0.019174
polarizability: 1.91218773e+02 1.48209938e+00 1.39505542e+02 -5.77629314e-03 -2.64514039e-03 4.68676283e+01
1716.lowfreq: -33.9749 -0.0011 -0.0004 -0.0002 7.3159 11.9854 14.3007 83.2107 108.3063
frequency: -33.8755 83.2098 108.3062 199.2981 223.5453 226.0459 259.4788 272.5547 333.0005 354.2807 375.7812 378.2600 400.1436 454.2528 486.8721 531.7730 560.7066 592.9625 657.2829 669.5936 703.2886 704.3964 742.3269 769.6353 811.7447 903.4087 946.0982 974.7616 986.1311 1032.2383 1063.4664 1143.5167 1179.9311 1190.2329 1243.4284 1289.1184 1349.4662 1377.1028 1404.1413 1432.5575 1448.5347 1455.0848 1475.4669 1518.0588 1590.2647 1602.3379 2997.5695 3079.6658 3100.8443 3156.5857 3180.0454
redmass: 9.6748 7.6546 5.0023 13.5118 1.1504 4.5051 5.1852 8.0802 6.5608 14.2836 6.7996 5.3520 7.1687 7.9324 7.0451 5.1102 9.7345 3.7996 8.4737 7.5848 10.2463 9.2372 10.9749 7.8169 1.3285 8.0599 4.4398 1.3142 2.9884 1.5662 2.3366 2.8184 2.8290 5.4976 2.1103 6.0842 4.7588 2.9203 1.3501 4.2671 1.0460 2.6476 1.6817 5.9975 9.5083 9.0767 1.0367 1.0949 1.1019 1.0884 1.0987
irintensity: 0.2897 0.2646 0.4920 1.8487 2.0580 0.0220 1.2577 0.0095 1.4561 1.7909 0.1841 0.6241 0.3601 1.5932 2.6863 0.5780 10.2254 7.7528 1.5798 0.1237 2.2158 6.4426 19.9543 7.5123 38.9373 27.3267 6.9352 1.0644 6.5103 10.1760 14.2509 3.3740 6.5480 287.8240 12.1709 22.8712 54.0821 154.0966 6.0999 6.0229 14.6028 38.6762 5.1864 109.2020 104.5808 243.5460 4.5433 2.3380 27.8833 4.3687 3.0489
temp: 298.150 k
press: 1.00000 atm
elementType: 8 8 8 8 7 7 7 6 6 6 6 6 6 6 1 1 1 1 1
symmnumber: 1
zpe: 317122.8 jmol-1
zpe.correction: 0.120786 hartree
zpe.thermalcorrener: 0.131514 hartree
zpe.thermalcorrenthalpy: 0.132459 hartree
zpe.thermalcorrgfe: 0.084483 hartree
zpe.sumelectzpe: -733.677092 hartree
zpe.sumelectthermal: -733.666363 hartree
zpe.sumelectthermalent: -733.665419 hartree
zpe.sumelectthermalfe: -733.713394 hartree
dipole: -0.6911 7.0220 0.0033
dipole: 7.0559
quadrupole: -93.8905 -80.2084 -77.8782
quadrupole: -5.5998 -0.0106 -0.0074
quadrupole: -9.8982 3.7840 6.1142 -5.5998 -0.0106 -0.0074
hfenergy: -733.7978773 hartree
pointgroup: C01 [X(C7H5N3O4)]
dipole: -0.1460924 2.7721523 0.0018309 debye
dipolederiv: -0.1792602 0.5208496 -0.0001045 -0.1493278 -0.1542698 0.0000464 -0.0000935 -0.0001228 -0.0696951 -1.4775192 -0.1883511 0.0003731 -0.4813346 -0.3455016 0.0001633 0.0004772 0.000086 -0.1312152 -1.0301333 -0.0198109 0.0006073 0.0592047 -0.4322552 -0.0003943 -0.0017756 0.0001372 -0.2153489 -0.4232652 -0.0207383 -0.0003167 -0.0551094 -0.7584053 0.0004283 -0.0000361 -0.0013063 -0.1970977 1.8349089 0.1333965 -0.0005008 0.3499916 0.4729249 -0.0001605 -0.0005666 -0.0001791 0.0594871 0.016748 -0.3763349 0.0001544 0.1771627 -0.0522063 0.0000312 0.0000684 0.0001708 -0.1107926 1.5100098 0.3141661 0.0000289 0.3688668 1.3088982 0.0003047 0.001338 0.0005334 0.1719216 0.2923662 -0.0268692 -0.0000581 -0.1899866 -0.055959 -0.0000889 -0.0000262 0.0002013 0.0856879 -0.3388616 -0.196695 -0.0002517 -0.4859045 -0.5319428 -0.0003109 0.0000876 0.0002738 0.0433384 -0.5128341 -0.0804461 0.0001977 0.4561308 -0.200862 -0.0000526 0.0002029 0.000099 0.099416 0.6033374 -0.2667424 -0.0002962 0.3940268 0.3001511 0.0000093 0.0001798 0.0003119 0.0472532 0.3334108 0.0255952 -0.0001028 -0.4333179 0.1850198 0.000029 -0.0001069 -0.000063 -0.0858453 -0.7048759 0.0091055 0.0001124 -0.0685158 0.1331063 -0.0000327 0.0002249 -0.0000732 -0.1539432 -0.3079678 0.2588774 0.0000777 0.0009816 0.1835968 -0.0000153 -0.0001721 0.0000301 -0.0126576 0.041949 -0.0617203 0.0000485 0.0091979 0.0714109 0.0000139 0.0000817 0.0000608 0.1755406 0.0696231 0.0642987 0.0000009 0.0164063 -0.0473341 0.0000025 -0.0001183 -0.0000348 0.1541086 0.0880032 -0.0042531 0.0509748 -0.009034 0.0410814 0.0615509 0.0505459 0.0337677 0.0149594 0.0962763 -0.0800158 0.0000457 0.0497112 -0.1585939 0.0000394 0.0000662 0.0000004 0.1096214 0.0880848 -0.0043117 -0.0509905 -0.0091499 0.0411404 -0.061564 -0.0503773 -0.0338932 0.0152614 unknown
polarizability: 191.2465484|-0.8714143|139.4777618|-0.0182725|0.0154543|46.8676328 unknown
InChI: InChI=1S/C7H5N3O4/c1-4-2-3-5-6(7(4)9(11)12)8-14-10(5)13/h2-3H,1H3
charge 0 multiplicity 1
19 atoms
O  2.26999 -1.674895 -0.000002
O  3.835239 0.272259 -0.000765
O  -3.314006 -0.713007 -0.000927
O  -1.702653 -2.325672 -0.001546
N  2.635477 -0.115321 -0.000346
N  0.867696 -1.79322 0.000376
N  -2.073367 -1.089931 0.001331
C  0.365322 -0.518147 0.000436
C  -1.012476 -0.065408 0.000874
C  1.408386 0.483762 -0.000035
C  -1.302334 1.316485 0.000732
C  1.136175 1.878548 -0.000122
C  -0.199387 2.259828 0.000264
C  -2.69381 1.914814 0.001076
H  1.953677 2.604983 -0.000479
H  -0.45085 3.324598 0.000219
H  -3.279328 1.584856 0.876578
H  -2.632874 3.015652 0.000765
H  -3.279977 1.584417 -0.873829
