program: Gaussian 09
title: 000003095
version: EM64L-G09RevD.01
frameworkgroup: C1[X(C24H27NO3)]
method: RPBEPBE
basis: SDD
operation: Freq
keyword: #p
keyword: freq=noraman
keyword: PBEPBE/SDD
title: #p freq=noraman PBEPBE/SDD
converged: YES YES NO NO
title: Mulliken charges:
elementType: O O O N C C C C C C C C C C C C C C C C C C C C C C C C H H H H H H H H H H H H H H H H H H H H H H H H H H H
charge: -0.420889 -0.309527 -0.314052 -0.281712 -0.119732 -0.264475 -0.550676 0.106753 0.378188 -0.051831 0.180906 -0.731024 -0.715653 -0.438316 -0.405231 -0.082018 0.270332 0.392486 0.092457 -0.615424 0.145397 -0.413645 -0.839144 0.170061 -0.246699 -0.378555 -0.520948 -0.519542 0.226300 0.247392 0.215934 0.214232 0.241081 0.208008 0.197763 0.241663 0.207931 0.234480 0.243296 0.234901 0.252535 0.371375 0.260497 0.269401 0.252917 0.232931 0.249099 0.230184 0.253423 0.211599 0.226917 0.261447 0.213213 0.226035 0.257956
chargesum: 0.00000
title: Mulliken charges with hydrogens summed into heavy atoms:
elementType: O O O N C C C C C C C C C C C C C C C C C C C C C C C C
charge: -0.049514 -0.309527 -0.314052 -0.040630 0.106568 -0.017084 -0.120510 0.106753 0.378188 -0.051831 0.180906 -0.083589 -0.029946 -0.203414 -0.152696 -0.082018 0.270332 0.392486 0.092457 -0.354928 0.145397 -0.144243 -0.104197 0.170061 -0.016515 -0.125131 0.179016 0.177662
polarizability: 4.06691478e+02 -5.57075247e+00 2.72968473e+02 1.13466132e+01 6.32567357e+00 1.96047746e+02
1716.lowfreq: -12.0779 -4.3552 -0.0006 -0.0003 0.0006 4.1744 21.8765 25.8611 31.7146
frequency: 21.6537 25.3660 31.6804 45.4878 75.4945 90.0370 99.2690 109.0860 122.6530 131.6374 147.3815 149.4138 154.6742 156.9719 163.5195 175.3888 182.7446 203.9870 216.6313 227.0194 231.1834 241.5904 247.2437 287.6668 296.5750 305.9651 323.6640 338.9655 356.0326 367.8505 395.2780 404.2455 426.7401 451.9805 453.8050 474.2863 478.1264 491.7291 504.7119 516.5027 530.8968 551.5590 567.9355 571.3232 593.2155 609.8147 634.9271 658.1240 666.6141 675.3696 682.6180 716.0102 741.6413 770.7124 774.7296 793.7091 814.2845 822.5701 833.6672 851.0509 891.5599 894.8574 903.1979 911.5759 913.7629 932.3985 947.5784 952.8319 976.0433 986.3528 993.2313 1023.2205 1034.4022 1043.2518 1044.0764 1050.4743 1074.9706 1090.1023 1101.0282 1107.2237 1109.1117 1110.5098 1143.5170 1150.9751 1155.8401 1159.0354 1170.2728 1177.2353 1185.6526 1192.9761 1204.0619 1207.0444 1215.0183 1233.2414 1258.6618 1277.9071 1284.1190 1298.9198 1317.8449 1333.4687 1340.4971 1348.5242 1361.1546 1372.4580 1376.0227 1378.2171 1387.2023 1394.8255 1402.0237 1422.8231 1426.6372 1429.0413 1437.5504 1445.6623 1450.2214 1453.9215 1455.6940 1464.6505 1469.9495 1470.0188 1471.8637 1476.3868 1477.9116 1479.4955 1479.9214 1485.7025 1512.9573 1563.1021 1572.9614 1593.1250 1610.7765 1620.8837 2943.0271 2966.6684 2968.2679 2971.3103 2979.3049 2989.1379 2993.7876 3009.4620 3013.7022 3058.5926 3064.3352 3073.5263 3075.5153 3088.4772 3089.4049 3093.4792 3104.1265 3116.9852 3118.7119 3118.9183 3137.2416 3145.6645 3148.0315 3159.6845 3171.3040 3402.5893 3490.2748
redmass: 4.4683 4.2598 4.5318 3.8818 3.4897 3.6771 1.1231 3.2430 3.0961 2.4853 1.3824 2.1869 2.5042 2.0529 1.4697 3.6640 3.7749 1.8516 3.6572 1.1705 1.3666 3.6800 4.6999 4.5458 3.3471 3.6460 4.5210 3.5496 4.1298 4.9285 3.8949 3.6537 4.7629 2.5929 5.7148 1.9453 1.8102 3.4379 2.9723 4.2263 4.6533 5.6869 4.1692 4.7942 4.8341 5.0010 4.4432 3.3815 4.0684 1.9928 4.0059 5.1093 4.6555 5.5825 1.8011 4.3080 2.0160 2.2951 2.9994 1.9572 1.9024 1.9659 1.9511 2.7529 1.5338 4.2418 1.8876 1.3634 3.6835 1.3386 2.6432 2.0305 2.9167 1.6235 1.6099 3.1231 2.4140 2.1668 2.1446 1.2864 1.2412 1.8811 2.5964 1.3839 1.3933 2.2792 1.7197 1.2150 1.6125 1.3714 1.6956 3.0686 2.6906 1.4699 2.4274 1.7514 2.3572 1.5676 1.4798 1.4465 4.7451 1.4842 2.8635 5.0436 4.2040 1.2187 1.2592 5.3513 1.2320 1.3783 2.6646 1.3774 1.1768 1.1875 1.7107 1.0632 1.1150 1.0541 1.1657 1.1487 1.0814 1.0548 1.0697 1.0573 1.0622 2.5444 3.6971 7.1578 7.6890 7.2668 6.8467 7.1275 1.0638 1.0328 1.0325 1.0390 1.0383 1.0510 1.0672 1.0842 1.0947 1.0954 1.0970 1.1004 1.1009 1.0994 1.0999 1.0994 1.1004 1.1030 1.1027 1.0875 1.0867 1.0967 1.0914 1.0917 1.0988 1.0740 1.0648
irintensity: 0.2176 0.1149 0.0189 0.2158 0.4003 0.1881 0.7818 0.2984 5.0012 3.5314 0.5305 2.5768 2.7239 3.9346 4.1887 1.2523 1.8686 0.2451 0.2305 0.0647 0.6326 1.4952 1.7150 8.8608 1.6915 3.7522 9.7537 4.6546 0.2909 7.4738 8.1192 1.5108 4.6409 12.3986 6.6856 23.6541 40.0050 0.5168 16.8749 6.4722 5.7579 3.3423 4.0086 3.2289 11.1388 0.5663 0.9274 3.4566 0.2793 148.0159 16.7941 6.3577 0.4636 3.1346 41.1678 21.2176 19.6119 16.4452 8.2061 12.8144 5.1422 8.5060 5.9217 12.3045 3.9329 45.0986 7.0914 1.1236 47.0963 1.6745 19.2663 5.0158 35.1136 7.4901 16.5281 78.0434 41.6782 3.7546 13.6385 4.6088 9.2672 29.4804 32.3748 0.8332 7.3596 3.1749 9.6165 6.7805 69.6695 51.5958 29.2460 80.3601 70.6695 8.7709 11.1510 10.0251 22.2653 1.3086 1.3356 8.7533 93.2361 1.1740 50.1237 24.1870 16.1652 21.5610 17.4568 17.3751 10.4510 11.3174 25.3179 6.4063 14.5600 6.0136 16.6601 10.0934 16.0316 16.1548 12.3938 18.4079 17.0457 13.6566 4.9017 15.6733 8.8588 11.4981 8.2242 16.0038 9.9912 113.3773 24.3655 32.1589 29.4752 108.1187 60.9290 36.2522 20.1569 8.2305 31.1064 12.2053 28.5358 10.8604 54.0481 29.1602 11.3191 35.8743 23.3830 25.4094 26.6420 22.4805 39.5995 8.0558 7.9756 15.0751 9.0237 7.1356 15.5491 2.3946 86.3526
temp: 298.150 k
press: 1.00000 atm
elementType: 8 8 8 7 6 6 6 6 6 6 6 6 6 6 6 6 6 6 6 6 6 6 6 6 6 6 6 6 1 1 1 1 1 1 1 1 1 1 1 1 1 1 1 1 1 1 1 1 1 1 1 1 1 1 1
symmnumber: 1
zpe: 1185297.6 jmol-1
zpe.correction: 0.451456 hartree
zpe.thermalcorrener: 0.478691 hartree
zpe.thermalcorrenthalpy: 0.479635 hartree
zpe.thermalcorrgfe: 0.394387 hartree
zpe.sumelectzpe: -1209.117018 hartree
zpe.sumelectthermal: -1209.089784 hartree
zpe.sumelectthermalent: -1209.088839 hartree
zpe.sumelectthermalfe: -1209.174087 hartree
dipole: -1.0450 -0.9278 1.1096
dipole: 1.7844
quadrupole: -159.7554 -155.6840 -166.2632
quadrupole: -7.8236 6.3984 -0.4474
quadrupole: 0.8121 4.8835 -5.6957 -7.8236 6.3984 -0.4474
hfenergy: -1209.5684743 hartree
pointgroup: C01 [X(C24H27N1O3)]
dipole: -0.4084898 -0.2611314 0.5077301 debye
polarizability: 406.7841178|-2.3427018|271.9050526|11.7468042|-10.8425801|197.0185263 unknown
InChI: InChI=1S/C24H27NO3/c1-13-11-20(28-5)23-17(7-6-8-19(23)27-4)21(13)18-10-9-16-12-14(2)25-15(3)22(16)24(18)26/h6-11,14-15,25-26H,12H2,1-5H3
charge 0 multiplicity 1
55 atoms
O  1.244561 0.939039 -1.669766
O  -4.820684 1.610858 -0.125523
O  -5.462721 -1.143905 -0.336567
N  5.323051 -0.264967 -1.304966
C  5.893962 -0.210782 0.0671
C  4.014192 0.429001 -1.439772
C  4.950325 -0.878423 1.104042
C  3.038099 0.093642 -0.299628
C  3.483965 -0.497063 0.91298
C  1.65503 0.375401 -0.44226
C  0.704633 0.101814 0.576847
C  7.292038 -0.850624 0.072507
C  4.22322 1.961698 -1.563249
C  2.546659 -0.776254 1.94214
C  1.179191 -0.482509 1.777185
C  -0.741269 0.45558 0.372515
C  -1.720279 -0.581995 0.115402
C  -1.148014 1.805044 0.467246
C  -3.134725 -0.251931 -0.031447
C  -2.525425 2.123659 0.268148
C  -3.490754 1.147196 0.015866
C  -1.30406 -1.950525 -0.01309
C  -0.164155 2.920229 0.778641
C  -4.065554 -1.344872 -0.212695
C  -2.229206 -2.966476 -0.250428
C  -3.618093 -2.663148 -0.333765
C  -5.338279 1.62692 -1.511315
C  -6.173174 -0.878207 0.933173
H  5.995977 0.860948 0.327183
H  3.559129 0.090448 -2.390089
H  5.2709 -0.62513 2.134211
H  5.050921 -1.981758 1.011587
H  5.261508 -1.24316 -1.62789
H  7.74439 -0.813323 1.080575
H  7.237777 -1.914532 -0.233074
H  7.956167 -0.325414 -0.634953
H  4.656151 2.385876 -0.639372
H  4.913615 2.167657 -2.398988
H  3.259657 2.462134 -1.756985
H  2.897788 -1.228335 2.877472
H  0.464492 -0.698409 2.579189
H  0.252781 1.010619 -1.675713
H  -2.859611 3.165358 0.317532
H  -0.239363 -2.183065 0.077294
H  0.537492 3.096043 -0.059026
H  -0.69192 3.867311 0.980473
H  0.454784 2.670832 1.658848
H  -1.894405 -4.003687 -0.357847
H  -4.363794 -3.44851 -0.491722
H  -4.684389 2.249082 -2.153323
H  -6.338031 2.082963 -1.442868
H  -5.42087 0.59983 -1.90674
H  -6.005777 -1.710667 1.644245
H  -7.239557 -0.824108 0.66441
H  -5.847648 0.082996 1.367448
