program: Gaussian 09
title: 000029037
version: EM64L-G09RevD.01
frameworkgroup: C1[X(C10H11ClO2)]
method: RPBEPBE
basis: SDD
operation: Freq
keyword: #p
keyword: freq=noraman
keyword: PBEPBE/SDD
title: #p freq=noraman PBEPBE/SDD
converged: YES YES NO NO
title: Mulliken charges:
elementType: Cl O O C C C C C C C C C C H H H H H H H H H H H
charge: -0.065577 -0.410802 -0.229963 0.153857 0.099339 0.372623 0.420768 -0.451549 -0.310852 -0.810794 -0.836553 -0.773944 0.024197 0.261421 0.264312 0.238024 0.235098 0.236027 0.238731 0.235668 0.240271 0.261223 0.228668 0.379805
chargesum: 0.00000
title: Mulliken charges with hydrogens summed into heavy atoms:
elementType: Cl O O C C C C C C C C C C
charge: -0.065577 -0.030997 -0.229963 0.153857 0.099339 0.372623 0.420768 -0.190127 -0.310852 -0.073360 -0.126126 -0.043782 0.024197
polarizability: 1.58909576e+02 -2.97674865e+00 1.48608120e+02 2.98635139e+00 -1.56028519e+00 6.80473264e+01
1716.lowfreq: -9.4692 -0.0025 -0.0015 -0.0007 3.9723 9.9335 53.7523 68.3877 82.6632
frequency: 53.7399 68.3257 82.6300 95.6992 110.4665 151.3107 183.2421 195.2826 235.9019 243.2469 322.0601 329.9976 347.5606 357.4873 375.0184 393.4104 463.7277 488.4046 578.8845 591.5794 604.2939 612.8843 659.9334 704.4880 761.0755 777.8844 846.7314 884.0597 966.6101 999.6306 1019.1190 1028.5182 1042.0292 1048.8763 1053.5609 1089.0731 1186.9662 1221.1546 1264.0435 1294.5331 1348.7156 1387.8483 1399.9453 1403.8488 1409.6793 1443.5394 1457.3512 1462.6066 1474.0527 1476.4334 1480.2457 1493.0100 1568.2713 1595.0515 1634.1073 2977.9651 2997.4785 3002.7832 3055.3853 3077.4010 3087.3476 3088.0528 3108.1883 3113.2270 3156.1925 3496.3015
redmass: 10.6893 1.5736 1.7187 2.9749 1.1703 3.2755 7.3179 1.0918 4.5584 4.2083 4.3947 5.2002 4.0500 3.0044 4.1850 4.4774 4.4998 3.0773 3.3320 3.9649 4.3608 1.4170 4.2216 4.2099 4.6321 6.0092 4.2863 1.3814 2.7380 2.4152 1.4383 1.4510 1.5379 1.8261 1.6430 1.9319 3.2998 1.5420 5.2091 2.8176 6.5550 4.8029 1.2552 1.2357 1.2133 2.0346 1.1865 1.1307 1.2208 1.0829 1.0904 1.0674 5.5269 7.9586 8.4583 1.0380 1.0392 1.0377 1.0971 1.0950 1.0966 1.0987 1.0990 1.0998 1.0926 1.0638
irintensity: 2.3433 0.1016 0.9323 0.2478 0.8428 3.6718 0.9677 0.0274 0.7829 3.5730 4.3583 4.4535 0.8798 0.6579 1.4143 2.4576 0.5768 9.3030 23.4149 1.7461 23.4548 116.7143 12.9844 29.2221 17.2276 9.2687 7.5296 11.2286 44.2903 148.8198 4.2338 16.1017 11.2048 11.4756 1.3701 130.1011 35.4356 0.8036 1.5927 49.0203 5.5705 43.0547 6.0410 25.5857 21.6978 6.4591 9.4754 25.2169 53.4794 10.5898 22.0382 5.1667 14.9226 16.2860 239.0653 27.5346 15.5886 13.7175 18.3773 11.5463 13.7411 20.9255 17.0485 8.3087 3.1488 30.3619
temp: 298.150 k
press: 1.00000 atm
elementType: 17 8 8 6 6 6 6 6 6 6 6 6 6 1 1 1 1 1 1 1 1 1 1 1
symmnumber: 1
zpe: 484059.7 jmol-1
zpe.correction: 0.184369 hartree
zpe.thermalcorrener: 0.198076 hartree
zpe.thermalcorrenthalpy: 0.199020 hartree
zpe.thermalcorrgfe: 0.143666 hartree
zpe.sumelectzpe: -997.229699 hartree
zpe.sumelectthermal: -997.215992 hartree
zpe.sumelectthermalent: -997.215048 hartree
zpe.sumelectthermalfe: -997.270402 hartree
dipole: -0.9005 0.9889 0.9107
dipole: 1.6181
quadrupole: -88.6405 -69.0841 -87.4852
quadrupole: 3.5141 -4.9475 -0.5363
quadrupole: -6.9039 12.6525 -5.7486 3.5141 -4.9475 -0.5363
hfenergy: -997.414068 hartree
pointgroup: C01 [X(C10H11Cl1O2)]
dipole: -0.0890579 -0.5327739 -0.3368824 debye
dipolederiv: -0.424091 -0.3585178 0.0092042 -0.3476044 -0.5747037 0.0091178 0.0118016 -0.0026196 -0.0757884 -0.5524001 0.2698903 -0.3193223 0.2838541 -0.6639788 0.2940326 -0.3880899 0.3155442 -0.7221152 -0.9219707 -0.1746079 0.252675 -0.0925788 -0.5135645 0.2383229 0.0623388 0.2440464 -0.5921126 0.1261174 0.3601784 -0.0133773 0.0306944 0.1440611 -0.0067407 0.0616959 -0.0519374 -0.047217 -0.4888798 0.0131956 -0.0003454 0.0975626 -0.0547393 0.0375981 0.0133286 0.0379657 -0.0783634 -0.0307999 -0.2998737 0.007559 -0.2072685 0.204076 0.0000947 -0.0241824 0.0154587 -0.0331321 -0.017168 -0.3236125 0.0129587 -0.1305513 0.0699009 0.0095843 -0.0659999 -0.0281671 0.0084241 -0.0751491 -0.1136354 0.0006477 -0.03384 -0.1747197 -0.0020092 0.0023999 0.005096 -0.1073033 0.4730148 0.7178414 -0.0156011 0.5941741 0.6346266 -0.0224083 -0.009534 -0.0142231 -0.0747528 -0.0487637 -0.1610068 0.0018295 -0.1065577 -0.0857573 0.0220727 0.0353677 0.083137 0.0483061 0.0455595 0.0267504 0.0030262 0.0881828 -0.136777 0.001121 0.0138373 -0.0105581 0.0619836 0.002497 0.1209679 0.0049928 0.0494513 -0.1523291 0.0167823 -0.0331855 0.073272 0.0584039 1.6411478 -0.0969117 0.0013954 -0.1992712 0.7240912 -0.6419291 0.1673401 -0.6298933 0.9199005 -0.0511551 0.019633 0.0015785 0.0254989 0.0903967 -0.0011635 0.002561 0.0024669 0.1506565 0.0856347 -0.0563356 0.0449585 -0.0425812 0.0512289 0.0106449 0.0526943 0.045451 -0.0452297 -0.0387096 -0.0263669 -0.0991205 0.02558 0.0681774 0.0397916 -0.1044246 -0.0042178 0.0242651 0.0422535 0.1315455 0.0495567 0.0538583 -0.0783197 -0.0478023 0.0230562 -0.0824941 0.0761545 -0.1427922 0.0313793 -0.0118965 -0.0872549 0.0840683 -0.0026461 -0.0119031 0.0016535 0.1089256 0.0691496 -0.0126691 0.0769223 0.0158854 -0.0275652 0.0794186 0.0309765 0.1162235 -0.0293968 0.0764001 -0.0060663 -0.0670227 0.0239518 -0.0333525 -0.0831837 -0.0280779 -0.1188152 -0.0438701 0.0312137 -0.1202759 -0.0642734 -0.0346326 -0.000635 -0.042174 -0.0309548 -0.0654666 0.0851107 0.1020415 0.0559453 -0.0449176 0.0494572 0.0369537 0.0228979 -0.0460355 0.0568525 -0.0479458 -0.0449301 0.0375024 0.1104091 -0.0082692 0.0686487 0.0276204 0.1135015 -0.0187105 0.0298356 0.1417799 -0.0349501 0.0581632 -0.047741 0.3202122 0.040957 0.1514882 0.0299354 0.3252611 unknown
polarizability: 153.295072|5.8962439|153.8492311|-1.3736427|-6.4740989|68.4207192 unknown
InChI: InChI=1S/C10H11ClO2/c1-5-4-8(11)7(3)9(6(5)2)10(12)13/h4,12H,1-3H3
charge 0 multiplicity 1
24 atoms
Cl 2.623234 2.499498 -0.066936
O  -2.683949 0.972884 -0.932923
O  -2.920884 -0.556881 0.783973
C  -0.070839 -1.29304 -0.001967
C  -0.663417 0.008569 -0.01329
C  1.351885 -1.400366 -0.016502
C  0.109769 1.214909 -0.022655
C  2.129128 -0.220348 -0.038322
C  1.51104 1.040773 -0.04013
C  -0.925236 -2.550436 0.01893
C  2.059135 -2.745185 -0.006614
C  -0.515738 2.596322 0.01607
C  -2.158861 0.090573 0.026426
H  3.221366 -0.285835 -0.048941
H  -1.291465 -2.758185 1.041116
H  -1.822107 -2.455375 -0.615567
H  -0.355919 -3.427682 -0.325609
H  3.152645 -2.611975 0.043152
H  1.754781 -3.361248 0.859502
H  1.836085 -3.333338 -0.917057
H  0.199323 3.334363 0.411538
H  -0.816504 2.918354 -0.996602
H  -1.422898 2.614901 0.64158
H  -3.676874 0.980045 -0.843772
