program: Gaussian 09
title: 000029105
version: EM64L-G09RevD.01
frameworkgroup: C1[X(C17H19Cl2NO)]
method: RPBEPBE
basis: SDD
operation: Freq
keyword: #p
keyword: freq=noraman
keyword: PBEPBE/SDD
title: #p freq=noraman PBEPBE/SDD
converged: YES YES NO NO
title: Mulliken charges:
elementType: Cl Cl O N C C C C C C C C C C C C C C C C C H H H H H H H H H H H H H H H H H H H
charge: -0.053956 -0.066805 -0.278575 -0.084148 -0.267278 0.486154 0.374465 -0.226555 -0.353423 -0.447110 -0.385586 -0.341103 -0.396926 -0.617007 -0.612538 -0.203813 -0.214973 -0.211417 -0.205923 -0.118790 -0.112333 0.205107 0.200684 0.185192 0.224761 0.173654 0.241722 0.251243 0.265642 0.297563 0.218810 0.186165 0.227649 0.221342 0.186244 0.231174 0.256278 0.254151 0.256631 0.253629
chargesum: 0.00000
title: Mulliken charges with hydrogens summed into heavy atoms:
elementType: Cl Cl O N C C C C C C C C C C C C C C C C C
charge: -0.053956 -0.066805 -0.278575 -0.084148 -0.062171 0.486154 0.374465 0.159321 0.044992 -0.205389 -0.134343 -0.075461 -0.099363 0.015617 0.026222 0.052465 0.039178 0.045214 0.047706 -0.118790 -0.112333
polarizability: 2.77518346e+02 -3.25484700e+00 2.09256579e+02 -1.08610406e+01 5.32197389e+00 1.52421398e+02
1716.lowfreq: -5.6424 -0.0014 -0.0011 -0.0010 1.0778 4.1762 15.7622 21.0598 22.9696
frequency: 15.5853 20.9669 22.9411 29.1412 36.0111 42.4736 58.7208 95.4407 116.3702 128.0882 183.1562 200.7245 205.8198 224.5087 240.7686 266.6918 279.7953 284.7568 301.7777 312.5152 328.6063 368.4925 404.2146 408.3914 410.9356 424.6341 430.0051 462.9945 488.4788 521.7724 578.6612 622.4226 625.4545 660.9095 673.3431 713.9920 725.6151 754.9409 793.8208 813.6033 832.0782 836.2062 847.9170 849.4785 886.2630 947.8970 951.2718 958.6571 969.7102 977.6406 991.1548 1000.0004 1001.5381 1034.0303 1040.4350 1050.3759 1069.7530 1071.7035 1085.0305 1094.7291 1105.1846 1109.3205 1133.6397 1174.3430 1177.0940 1180.5177 1185.6211 1211.4139 1234.4295 1266.8742 1269.9799 1281.7098 1292.8560 1297.2828 1305.2668 1364.0150 1370.2926 1377.7554 1384.0772 1389.3097 1399.3615 1418.6811 1435.9636 1456.0277 1462.0113 1468.5749 1473.7783 1475.0581 1476.8395 1479.1799 1485.2747 1585.3332 1588.0800 1597.4026 1600.2270 2829.8683 2839.1139 2857.3065 2894.5456 2936.3456 2987.5468 3019.5285 3025.3386 3043.0212 3078.7201 3082.6784 3123.6832 3138.1198 3145.0041 3156.4692 3168.0510 3169.2785 3171.2317 3175.4098
redmass: 4.7623 3.4408 4.5261 6.0916 3.2718 3.9965 4.8832 4.1527 6.9916 7.3532 6.4724 1.8807 5.2766 1.4238 1.4992 4.7629 4.0424 2.7105 4.1016 5.3017 5.5395 1.9929 2.8472 2.8950 2.7069 5.3801 3.5414 4.5594 3.5828 3.1301 3.3057 6.9202 6.7958 6.1980 4.6626 4.4074 3.8399 3.3956 2.1381 1.9820 1.2966 1.4896 1.9983 2.0838 2.6424 1.9915 1.4581 1.4295 1.3752 3.4098 1.4178 4.0287 4.1036 1.5626 3.3475 1.8435 2.8114 2.6643 1.6752 1.7374 1.3765 1.3539 1.4463 1.4892 1.9264 1.1300 1.4313 1.7797 1.4775 1.8749 2.0938 1.4035 1.2582 1.4009 1.3654 1.3878 5.5761 1.9557 3.0873 3.4595 2.2510 1.1431 1.1252 1.1129 1.0461 1.0832 2.2606 2.4136 1.0924 1.0754 1.0549 7.7139 7.4567 6.1970 6.2265 1.0692 1.0579 1.0589 1.0816 1.0566 1.1039 1.0716 1.0709 1.0875 1.1010 1.1005 1.0899 1.0892 1.0891 1.0888 1.0952 1.0956 1.0966 1.0971
irintensity: 0.4196 0.3927 0.0519 0.1814 0.1216 0.0539 0.0818 0.3118 0.8773 0.1502 6.2817 1.6338 0.8498 0.6718 0.4719 1.5793 1.6922 4.6667 4.2457 0.5402 1.8754 4.6666 1.4940 0.0781 0.5934 21.0750 7.3081 7.5674 13.3470 47.6454 15.0220 0.7412 0.9466 11.4805 4.2926 4.8802 0.0642 13.9725 55.2900 65.5455 0.5746 7.5168 23.7658 32.2049 14.2001 26.6738 17.4471 1.8136 0.2048 51.6978 6.8508 62.2790 27.6518 28.6364 103.6290 17.6185 40.7256 35.3826 12.1315 20.7454 9.2986 4.5829 8.3394 6.8575 3.2683 3.3036 4.5367 3.3536 13.7227 24.6822 7.0843 20.7721 0.5291 27.1025 4.5768 12.1563 1.3933 1.2571 4.7424 8.5512 7.2659 3.8826 3.0756 13.0332 13.8449 3.8588 39.6044 110.1773 28.1078 20.7818 12.9093 5.4811 2.8830 19.4677 6.8292 56.5867 77.0731 290.5699 33.1399 66.4474 49.7724 35.7178 47.6636 20.6021 21.6461 55.4684 9.6425 7.3030 2.4929 1.2431 5.8115 4.5569 0.6760 3.7896
temp: 298.150 k
press: 1.00000 atm
elementType: 17 17 8 7 6 6 6 6 6 6 6 6 6 6 6 6 6 6 6 6 6 1 1 1 1 1 1 1 1 1 1 1 1 1 1 1 1 1 1 1
symmnumber: 1
zpe: 832166.9 jmol-1
zpe.correction: 0.316956 hartree
zpe.thermalcorrener: 0.338211 hartree
zpe.thermalcorrenthalpy: 0.339155 hartree
zpe.thermalcorrgfe: 0.261826 hartree
zpe.sumelectzpe: -1707.719989 hartree
zpe.sumelectthermal: -1707.698734 hartree
zpe.sumelectthermalent: -1707.697790 hartree
zpe.sumelectthermalfe: -1707.775118 hartree
dipole: -0.5846 3.8471 1.2973
dipole: 4.1018
quadrupole: -154.0617 -135.0600 -131.5087
quadrupole: 9.7032 -4.1369 -0.3653
quadrupole: -13.8515 5.1501 8.7014 9.7032 -4.1369 -0.3653
hfenergy: -1708.0369443 hartree
pointgroup: C01 [X(C17H19Cl2N1O1)]
dipole: 1.4516039 -0.2525771 0.6582541 debye
polarizability: 214.3714172|19.9230027|268.5919337|15.8876191|16.5322735|156.2329718 unknown
InChI: InChI=1S/C17H19Cl2NO/c1-20(2)11-12-21-17(13-3-7-15(18)8-4-13)14-5-9-16(19)10-6-14/h3-10,17H,11-12H2,1-2H3
charge 0 multiplicity 1
40 atoms
Cl 0.686366 6.07095 -0.176079
Cl -5.348033 -2.453099 -1.005038
O  1.121596 -0.741299 -0.121388
N  3.160194 -3.001893 0.037991
C  0.082342 -0.014955 0.629742
C  0.215731 1.495768 0.441415
C  -1.263188 -0.591615 0.177088
C  2.467671 -0.608247 0.44926
C  3.387691 -1.579503 -0.298205
C  0.369076 2.358398 1.551524
C  -2.461184 0.148884 0.328862
C  0.214467 2.050106 -0.86445
C  -1.327197 -1.910441 -0.337444
C  3.696321 -3.381991 1.358543
C  3.612998 -3.916805 -1.028215
C  0.51002 3.755427 1.376879
C  -3.709151 -0.410956 -0.025822
C  0.3584 3.439136 -1.061153
C  -2.566455 -2.481833 -0.702683
C  0.502039 4.271831 0.068364
C  -3.739618 -1.721358 -0.538112
H  0.208535 -0.239688 1.716261
H  2.837462 0.431386 0.318417
H  2.437183 -0.828224 1.539043
H  3.199332 -1.443687 -1.379104
H  4.450066 -1.270246 -0.108773
H  0.379811 1.944481 2.567414
H  -2.429344 1.172506 0.718024
H  0.106097 1.384746 -1.727666
H  -0.397583 -2.474168 -0.457288
H  3.261223 -2.746691 2.149686
H  4.812539 -3.296532 1.423074
H  3.420434 -4.427626 1.582871
H  3.337288 -4.954335 -0.766401
H  4.719802 -3.891825 -1.202505
H  3.110351 -3.660146 -1.977371
H  0.626663 4.421993 2.23613
H  -4.633701 0.16178 0.090055
H  0.358206 3.867681 -2.067653
H  -2.616749 -3.498108 -1.10449
