program: Gaussian 09
title: 000028957
version: EM64L-G09RevD.01
frameworkgroup: C1[X(C12H18N2O)]
method: RPBEPBE
basis: SDD
operation: Freq
keyword: #p
keyword: freq=noraman
keyword: PBEPBE/SDD
title: #p freq=noraman PBEPBE/SDD
converged: YES YES NO NO
title: Mulliken charges:
elementType: O N N C C C C C C C C C C C C H H H H H H H H H H H H H H H H H H
charge: -0.328937 -0.101403 -0.394469 -0.475805 -0.335290 -0.356128 -0.617822 -0.610423 0.325546 0.065634 -0.327623 -0.292625 -0.173399 -0.171514 -0.232612 0.214521 0.216304 0.195362 0.221535 0.224508 0.249336 0.343718 0.222192 0.191100 0.225954 0.190107 0.234757 0.220158 0.230424 0.231024 0.200950 0.204888 0.210034
chargesum: 0.00000
title: Mulliken charges with hydrogens summed into heavy atoms:
elementType: O N N C C C C C C C C C C C C
charge: -0.328937 -0.101403 -0.050751 -0.044980 0.081606 0.117715 0.021423 0.034599 0.325546 0.065634 -0.097199 -0.061601 0.027551 0.033373 -0.022577
polarizability: 2.12506397e+02 -1.60264868e+01 1.59352568e+02 3.00106464e+01 5.82739794e+00 1.09278380e+02
1716.lowfreq: -12.4496 -8.7992 -4.3826 -0.0001 0.0005 0.0006 17.1518 21.4654 35.3879
frequency: 16.9681 20.3927 35.3156 71.5234 101.4332 135.9213 166.1042 192.6941 202.3577 223.6026 230.8212 302.6150 324.3151 368.5814 383.4615 388.8948 407.7867 414.0847 420.5452 465.2814 520.2759 529.1092 603.4645 700.0387 717.4346 723.4873 743.2264 759.3859 786.9109 833.4604 849.4427 868.2605 887.4388 904.6134 947.3424 967.2279 985.6211 999.7631 1004.3767 1034.9898 1040.3527 1069.5790 1084.6505 1096.8234 1103.9291 1137.3231 1178.0922 1212.1233 1220.5771 1227.9012 1263.7282 1269.9610 1286.8396 1297.6290 1317.1877 1349.4102 1357.1838 1372.3862 1390.3051 1394.9524 1419.6808 1440.1499 1443.7619 1458.0238 1462.9102 1468.9521 1472.4384 1476.0741 1478.5188 1486.1713 1489.1488 1521.5546 1556.9545 1594.0098 1619.9987 2851.4407 2852.5845 2870.3955 2948.4972 2989.5116 3010.0840 3021.5247 3023.2357 3026.9614 3054.1685 3079.6238 3083.5036 3091.8353 3097.5747 3119.7047 3128.3216 3139.9378 3309.5937
redmass: 4.3772 3.5785 2.9666 3.7732 3.6208 4.0274 3.1954 2.8422 2.3177 1.2293 1.2554 2.4736 3.5792 2.3419 3.3966 3.3595 2.5001 3.0516 2.7981 5.2299 2.8951 5.2012 3.1192 6.5568 1.9130 2.5819 1.3828 3.9461 1.3343 1.8785 1.6701 5.3592 2.5382 1.4136 2.0637 2.5679 1.3416 2.1270 1.3209 1.5460 2.3600 1.8117 1.4550 1.8447 2.2333 1.4676 1.9319 1.3518 1.3491 1.4076 1.9540 1.8214 1.2164 1.2738 1.4429 1.3732 1.5134 1.3270 2.2554 1.5885 1.1418 1.2212 2.2002 1.0907 1.0511 1.1396 1.1342 1.0720 1.0677 1.0827 2.2544 3.3880 3.8975 4.4910 7.4853 1.0641 1.0605 1.0597 1.0607 1.0681 1.0942 1.0747 1.0850 1.0754 1.0982 1.1006 1.1006 1.0824 1.0862 1.0888 1.0913 1.0955 1.0749
irintensity: 0.3974 0.8983 0.9722 0.5461 2.0994 1.6563 0.1605 0.1810 3.6972 0.1574 2.1947 4.7005 18.1439 3.5931 0.4060 4.8259 1.3884 4.7820 2.5624 7.4253 1.1169 1.0211 0.2221 0.7373 3.0032 43.0928 137.4025 11.3354 44.5043 0.6952 0.9369 7.7258 1.4898 12.5786 4.5258 15.6147 0.4313 29.5940 3.0329 13.6385 7.7473 6.9898 2.3263 4.5368 22.2170 3.0867 18.0791 12.9169 12.9269 9.7589 3.7491 10.1271 29.7168 1.2590 0.8030 17.6716 1.8032 8.8613 53.2943 9.2652 3.4922 36.8731 87.3834 2.9807 10.1235 39.5783 97.5105 30.4501 37.1115 18.2953 90.3215 60.8289 282.6022 33.8691 180.7712 50.3747 76.5085 286.9920 39.8534 24.5828 31.6276 43.0333 15.2928 33.8023 54.1753 25.5767 49.6004 9.6213 7.6509 23.5545 34.7024 25.4648 56.4957
temp: 298.150 k
press: 1.00000 atm
elementType: 8 7 7 6 6 6 6 6 6 6 6 6 6 6 6 1 1 1 1 1 1 1 1 1 1 1 1 1 1 1 1 1 1
symmnumber: 1
zpe: 735681.6 jmol-1
zpe.correction: 0.280206 hartree
zpe.thermalcorrener: 0.295717 hartree
zpe.thermalcorrenthalpy: 0.296661 hartree
zpe.thermalcorrgfe: 0.235094 hartree
zpe.sumelectzpe: -651.616530 hartree
zpe.sumelectthermal: -651.601019 hartree
zpe.sumelectthermalent: -651.600074 hartree
zpe.sumelectthermalfe: -651.661641 hartree
dipole: -2.5598 -3.0784 -0.7223
dipole: 4.0683
quadrupole: -77.2599 -95.5605 -89.8658
quadrupole: -6.4343 3.6502 0.7213
quadrupole: 10.3021 -7.9985 -2.3037 -6.4343 3.6502 0.7213
hfenergy: -651.8967358 hartree
pointgroup: C01 [X(C12H18N2O1)]
dipole: -0.9636268 -1.2094572 0.4129108 debye
polarizability: 212.7704734|4.4192614|150.5955267|33.9020118|-18.9570077|117.7713453 unknown
InChI: InChI=1S/C12H18N2O/c1-14(2)10-6-9-13-11-7-4-3-5-8-12(11)15/h3-5,7-8,13H,6,9-10H2,1-2H3
charge 0 multiplicity 1
33 atoms
O  1.189831 2.086224 -1.28568
N  -3.543641 -0.12829 0.671586
N  -0.198055 -0.035881 -1.082895
C  -2.574846 -0.424423 -1.63607
C  -3.197724 0.545146 -0.603193
C  -1.256406 -1.048386 -1.138235
C  -4.754367 -0.968211 0.575452
C  -3.615707 0.809504 1.811764
C  1.036012 -0.162796 -0.513501
C  1.808434 1.127195 -0.664565
C  1.450103 -1.366699 0.104223
C  3.147094 1.319906 -0.162652
C  2.672484 -1.67994 0.747553
C  4.008384 0.458969 0.528718
C  3.816216 -0.887091 0.946353
H  -3.283863 -1.240474 -1.868569
H  -2.403439 0.120159 -2.586492
H  -4.087269 1.046847 -1.063107
H  -2.466957 1.343392 -0.373604
H  -0.949214 -1.883929 -1.802504
H  -1.436038 -1.46186 -0.125388
H  -0.325703 0.902351 -1.507465
H  -4.638583 -1.726852 -0.217874
H  -5.680141 -0.377552 0.354408
H  -4.909984 -1.503589 1.529098
H  -4.438664 1.56285 1.718939
H  -2.660365 1.354752 1.906518
H  -3.77982 0.243414 2.746532
H  0.716292 -2.182613 0.08486
H  3.521579 2.329853 -0.376899
H  2.728067 -2.702099 1.148655
H  4.984474 0.894008 0.787429
H  4.652216 -1.356382 1.480206
