program: Gaussian 09
title: 000002893
version: EM64L-G09RevD.01
frameworkgroup: C1[X(C17H24O3)]
method: RPBEPBE
basis: SDD
operation: Freq
keyword: #pfreq=noraman
keyword: PBEPBE/SDD
title: #p freq=noraman PBEPBE/SDD
converged: YES YES NO NO
title: Mulliken charges:
elementType: O O O C C C C C C C C C C C C C C C C C H H H H H H H H H H H H H H H H H H H H H H H H
charge: -0.262621 -0.259268 -0.455822 0.367650 -0.472334 -0.031201 -0.499255 -0.014629 -0.481312 -0.751152 -0.745231 -0.745622 0.210171 -0.305486 0.389027 -0.365044 -0.379577 -0.227862 -0.220415 -0.239932 0.189460 0.200593 0.218131 0.239257 0.212343 0.257418 0.219770 0.202048 0.212785 0.217610 0.212900 0.211144 0.212702 0.220728 0.218222 0.210362 0.218042 0.260030 0.366642 0.245983 0.265636 0.224627 0.226010 0.227476
chargesum: 0.00000
title: Mulliken charges with hydrogens summed into heavy atoms:
elementType: O O O C C C C C C C C C C C C C C C C C
charge: -0.262621 -0.259268 -0.089181 0.367650 -0.082281 0.186930 -0.047656 0.242789 -0.059494 -0.107858 -0.100657 -0.098997 0.210171 -0.045456 0.389027 -0.119061 -0.113941 -0.003235 0.005595 -0.012457
polarizability: 2.08631678e+02 -1.18702259e+01 1.80848969e+02 1.97450132e+01 9.64967739e+00 1.67218663e+02
1716.lowfreq: -17.1612 -7.2895 -2.6429 0.0007 0.0008 0.0010 9.0373 18.9707 28.7003
frequency: 7.4975 18.6518 28.4557 59.9115 69.6341 90.1995 126.1161 145.6172 164.9885 183.3335 197.9272 212.9466 215.9363 226.0953 249.1298 257.4035 271.2712 308.5642 323.9779 326.8306 382.9562 402.1034 404.2191 415.0093 430.1612 434.9929 441.3283 464.1425 480.6066 506.8703 538.5255 594.9936 615.5202 654.6153 698.8119 716.9073 761.7431 763.1187 829.9912 837.9840 855.9916 856.5738 867.2030 877.3204 895.1340 909.7362 918.9326 931.9487 934.3042 949.4296 976.8799 979.8288 981.9430 989.5978 997.8073 1011.0604 1018.5254 1027.4510 1047.7869 1079.0360 1084.3461 1094.2781 1133.4325 1156.5805 1164.9430 1168.3205 1174.6092 1186.8674 1188.0807 1195.9601 1224.1141 1244.3540 1269.2866 1273.3249 1274.8356 1282.8037 1292.8820 1304.0210 1319.8116 1335.0117 1342.5149 1349.2455 1352.5208 1368.1258 1378.1883 1387.6022 1388.6630 1396.2964 1436.7773 1452.0015 1453.9573 1464.4115 1465.6964 1473.4621 1477.1172 1477.8973 1478.3165 1481.0861 1488.7767 1594.8828 1604.8169 1612.8642 2950.5089 2964.8878 2966.9255 2969.0071 2974.9656 2981.1616 2984.8471 3016.7033 3024.3828 3024.6434 3046.9532 3056.0429 3062.3731 3062.8273 3065.7317 3069.4964 3070.6555 3073.6696 3122.1866 3131.5840 3144.3264 3157.8091 3169.3517 3444.5281
redmass: 3.8400 4.3518 4.1283 4.6294 7.2624 4.3643 2.5276 2.3685 4.2164 1.0719 3.6405 2.8664 1.3155 1.2666 3.5688 2.5149 2.8132 2.9108 2.8573 5.3823 2.5595 2.9477 2.8234 2.3827 1.9869 1.6813 2.2218 2.6695 2.9013 2.7497 4.1702 6.1581 6.4345 5.9593 3.0613 1.8474 2.6698 3.2569 3.5952 3.3069 1.3131 1.5366 1.5094 2.7166 3.3261 2.7560 1.8389 1.4530 1.6103 1.9020 1.5532 1.4405 1.5107 4.5626 1.3586 1.3873 4.5163 2.2207 1.6810 2.1265 1.6104 1.2679 2.1693 2.3620 2.4320 1.4039 1.3457 2.2406 1.3894 2.1465 1.8202 2.1553 1.2826 1.3402 1.3063 1.3764 1.7481 1.4184 1.3159 1.3880 1.5276 1.4378 1.5960 1.6084 1.2029 1.2247 3.9857 1.2056 2.1818 1.0848 1.0813 1.0701 1.0528 1.0540 1.0751 1.0750 2.1433 1.0611 1.0569 6.3078 7.9473 6.8555 1.0618 1.0408 1.0730 1.0362 1.0381 1.0609 1.0607 1.1000 1.0844 1.0861 1.1012 1.1009 1.0996 1.0998 1.0992 1.0989 1.0991 1.0981 1.0846 1.0883 1.0937 1.0969 1.0981 1.0648
irintensity: 0.2109 0.2057 0.0199 0.6348 0.8170 0.0441 0.0324 0.0794 2.7959 0.3113 2.3801 3.6179 1.2113 0.2467 0.0469 2.5054 4.8449 3.1089 5.9440 24.7478 37.2360 0.6145 0.9457 7.1022 39.7832 31.2405 5.7495 7.0643 6.2113 15.4094 10.0315 6.1836 0.6544 11.2477 12.9148 81.7675 20.4536 0.6016 16.7766 13.0545 1.0922 7.3963 2.3907 27.2147 24.1153 8.7695 1.4329 1.5580 3.0662 1.4870 3.5941 0.2107 7.0564 0.3347 0.7172 3.2395 140.1793 30.6494 3.6192 17.8388 12.4243 1.4451 31.8627 35.9121 216.4613 57.5182 4.3739 5.4548 5.4913 2.2558 205.5203 0.3971 12.0146 2.8081 0.4555 0.5076 3.6671 13.4003 5.4081 1.8538 2.4828 6.5821 4.8283 51.2000 19.9094 9.6121 7.5249 16.2138 12.7883 4.4595 1.0806 0.8103 2.6579 4.0061 22.1011 6.0588 27.1663 9.2962 17.1719 2.2050 117.3808 39.2178 22.3195 21.6989 27.2768 40.0550 27.3916 30.8933 19.7326 39.4634 12.1360 4.2235 12.5589 3.0741 11.1633 12.6149 100.1804 40.2660 75.6488 53.3380 0.6179 6.7712 28.8109 21.7014 14.1653 45.1342
temp: 298.150 k
press: 1.00000 atm
elementType: 8 8 8 6 6 6 6 6 6 6 6 6 6 6 6 6 6 6 6 6 1 1 1 1 1 1 1 1 1 1 1 1 1 1 1 1 1 1 1 1 1 1 1 1
symmnumber: 1
zpe: 979707.1 jmol-1
zpe.correction: 0.373151 hartree
zpe.thermalcorrener: 0.393686 hartree
zpe.thermalcorrenthalpy: 0.394631 hartree
zpe.thermalcorrgfe: 0.321771 hartree
zpe.sumelectzpe: -886.358975 hartree
zpe.sumelectthermal: -886.338440 hartree
zpe.sumelectthermalent: -886.337496 hartree
zpe.sumelectthermalfe: -886.410355 hartree
dipole: 3.5013 2.2320 0.8935
dipole: 4.2473
quadrupole: -121.2316 -122.5383 -120.1938
quadrupole: -9.4164 2.9525 -0.8164
quadrupole: 0.0897 -1.2171 1.1274 -9.4164 2.9525 -0.8164
hfenergy: -886.7321261 hartree
pointgroup: C01 [X(C17H24O3)]
dipole: -1.3821465 -0.9390776 0.0061416 debye
polarizability: 208.9039257|-4.15295|185.5828889|-22.369381|-2.5837194|162.212496 unknown
InChI: InChI=1S/C17H24O3/c1-12-9-14(11-17(2,3)10-12)20-16(19)15(18)13-7-5-4-6-8-13/h4-8,12,14-15,18H,9-11H2,1-3H3
charge 0 multiplicity 1
44 atoms
O  0.024244 0.747166 0.902363
O  0.676553 2.258793 -0.756783
O  3.139935 2.536024 0.336836
C  -2.879239 -0.568065 -1.320553
C  -3.808767 -0.909038 -0.11602
C  -3.756401 0.117351 1.045375
C  -1.429565 -0.33632 -0.790912
C  -1.387173 0.69473 0.3475
C  -2.291076 0.310075 1.521156
C  -2.857377 -1.767209 -2.302868
C  -3.393107 0.685347 -2.081811
C  -4.658973 -0.317879 2.220198
C  0.93587 1.520942 0.229285
C  2.359824 1.405808 0.812859
C  2.987804 0.053111 0.427177
C  2.535988 -1.146463 1.03217
C  4.029125 0.003507 -0.527821
C  3.116529 -2.383892 0.676592
C  4.605793 -1.236718 -0.886209
C  4.151398 -2.433806 -0.28732
H  -3.516682 -1.903219 0.285716
H  -4.852364 -1.006913 -0.477502
H  -4.130652 1.093714 0.671459
H  -0.775756 -0.008969 -1.620565
H  -1.027541 -1.294034 -0.403497
H  -1.615167 1.709052 -0.029074
H  -2.238898 1.084538 2.309215
H  -1.922791 -0.637907 1.96317
H  -3.870893 -1.972105 -2.69677
H  -2.193639 -1.564696 -3.164562
H  -2.494475 -2.685459 -1.803288
H  -4.404667 0.500315 -2.489866
H  -3.452119 1.582657 -1.440275
H  -2.724045 0.927822 -2.928363
H  -5.7096 -0.432754 1.895061
H  -4.324731 -1.289561 2.632191
H  -4.636788 0.422695 3.041338
H  2.291155 1.478713 1.913594
H  2.651932 2.922671 -0.443676
H  1.729077 -1.111672 1.77304
H  4.393963 0.940503 -0.959119
H  2.7653 -3.306663 1.152372
H  5.414368 -1.266086 -1.625454
H  4.602228 -3.394107 -0.562261
