program: Gaussian 09
title: 000003040
version: EM64L-G09RevD.01
frameworkgroup: C1[X(C19H16Cl2N3O5S)]
method: RPBEPBE
basis: SDD
operation: Freq
keyword: #p
keyword: freq=noraman
keyword: PBEPBE/SDD
title: #p freq=noraman PBEPBE/SDD
converged: NO NO NO NO
title: Mulliken charges:
elementType: Cl Cl S O O O O O N N N C C C C C C C C C C C C C C C C C C C H H H H H H H H H H H H H H H H
charge: -0.041000 -0.043332 0.138637 -0.219948 -0.391034 -0.377998 -0.294836 -0.222887 -0.057554 -0.357231 -0.021012 -0.446258 -0.077703 -0.223062 -0.192437 0.070354 -0.692168 -0.681236 0.111310 0.149581 -0.090524 0.062891 0.278948 0.484163 -0.773725 -0.328582 -0.308286 -0.206053 -0.266394 -0.194855 0.331150 0.252963 0.296522 0.210502 0.247095 0.214443 0.244236 0.187607 0.261501 0.339800 0.249340 0.279569 0.227716 0.326631 0.257333 0.285823
chargesum: -1.00000
title: Mulliken charges with hydrogens summed into heavy atoms:
elementType: Cl Cl S O O O O O N N N C C C C C C C C C C C C C C C C C C C
charge: -0.041000 -0.043332 0.138637 -0.219948 -0.391034 -0.377998 -0.294836 -0.222887 -0.057554 -0.017431 -0.021012 -0.115108 -0.077703 0.029900 0.104086 0.070354 -0.020128 0.012108 0.111310 0.149581 -0.090524 0.062891 0.278948 0.484163 -0.017100 -0.328582 -0.308286 0.120578 -0.009060 0.090968
polarizability: 3.75453136e+02 3.86585547e+01 2.59854913e+02 -1.18074079e+01 1.65320863e+01 2.25736700e+02
1716.lowfreq: -40.1924 -8.3583 -0.0021 -0.0020 -0.0018 4.2779 8.0358 21.3319 26.4149
frequency: -40.1634 20.5841 25.9011 38.2838 41.0545 48.6746 53.2035 60.7891 67.4797 68.0803 87.5077 104.7458 114.4269 136.7564 147.3490 151.0322 183.3139 185.6010 199.3766 216.4853 216.9510 235.5650 248.8354 259.7849 278.4644 287.6317 289.8252 297.9564 313.4007 327.0765 333.3330 361.2598 369.1891 380.9239 385.2565 396.7852 430.8469 446.0888 468.7734 474.1857 490.3160 508.3906 513.2391 554.3611 556.9633 603.3324 617.8003 625.4186 659.8700 677.3527 688.8126 703.5826 705.3780 718.7349 730.7653 739.9078 762.5430 768.4043 773.7154 790.3271 806.4911 847.2289 861.9722 873.3010 884.6832 932.5707 937.2000 939.4259 949.5853 958.0053 966.1327 988.6937 1007.3083 1039.2032 1044.1708 1055.0490 1064.4922 1068.1291 1107.6168 1127.1986 1149.1518 1152.6408 1156.9973 1162.8209 1181.9497 1189.6587 1196.4711 1216.8845 1228.0261 1233.9367 1240.4011 1270.5665 1285.5627 1302.9364 1312.5861 1351.6681 1367.2058 1375.5189 1382.7315 1393.9425 1401.8861 1406.8108 1435.6972 1439.9048 1458.5673 1465.9443 1467.2886 1477.7247 1478.3522 1504.5813 1547.9293 1558.4521 1579.8776 1585.0503 1603.7077 1703.1370 2964.9734 2981.6644 2993.3733 3050.1999 3060.7923 3076.7448 3076.9911 3083.1832 3103.8047 3104.1039 3124.2917 3129.9238 3170.0824 3187.9040 3208.9628 3521.8457
redmass: 1.0288 9.4592 11.4593 5.8125 7.2377 7.8753 8.5199 7.4611 12.4180 7.8360 7.8833 12.2664 9.1047 7.3480 6.6049 8.2536 10.1680 5.1045 4.5665 3.1509 1.5903 3.6357 4.9703 2.9179 1.2448 5.4490 4.2014 5.8936 4.9550 5.5212 3.5811 5.7006 6.0652 4.7271 6.6935 8.0432 9.4770 6.5333 4.7204 6.1040 6.0032 4.7377 5.2707 5.0551 4.5246 6.0968 1.3913 4.1972 6.6636 7.1656 6.4449 5.8073 5.8279 6.5661 7.2653 5.9045 6.4631 1.6164 6.6395 9.2788 9.4600 4.6766 4.7184 1.3813 4.2190 2.2765 3.6652 1.5652 4.0358 2.6567 1.5493 3.2635 1.3430 3.4336 1.5089 5.4760 2.6264 2.7536 1.6923 2.4725 1.5675 1.8155 2.1863 2.0247 2.2987 1.3769 2.6471 1.4170 3.1270 6.0175 1.6835 1.6396 2.0530 2.0258 5.6727 8.0713 3.7264 1.1989 3.8030 1.1959 1.3888 2.3587 1.0665 1.0637 1.0506 1.0540 1.0799 1.1708 3.6908 2.0303 7.0889 8.4609 5.1391 9.0071 8.8886 12.5805 1.0360 1.0359 1.0389 1.0860 1.0967 1.0942 1.0999 1.1000 1.0882 1.0969 1.1002 1.0887 1.0890 1.0954 1.0966 1.0774
irintensity: 0.2001 2.0547 0.9287 2.1442 1.4430 1.5097 0.4954 4.1091 1.5769 2.9042 1.9195 13.9385 9.9709 4.3543 12.1488 2.8055 1.5347 2.2852 7.4218 0.7177 3.1362 3.9157 16.5187 1.7687 0.7907 1.4610 0.4056 4.1198 1.0185 4.6029 5.0844 3.9365 5.4700 3.2492 7.1674 1.9051 7.9497 2.4672 1.0086 16.6542 2.0688 28.3666 6.4804 9.5691 6.3930 0.2462 45.4598 6.7598 12.4511 1.8098 5.5859 56.6341 5.7374 5.5196 70.2583 17.4584 32.8074 72.5547 11.9359 5.4671 7.4031 11.7050 12.2647 1.1785 0.3445 4.9537 3.9591 2.1680 6.0275 10.3109 1.1683 18.2505 1.0664 29.3841 9.1865 1.2703 6.9582 24.0707 22.3708 25.5183 7.2804 17.4625 5.7739 12.9484 39.4050 31.6406 71.2804 10.6015 7.7768 137.4621 16.1895 9.4182 52.9144 79.1722 12.1540 5.3059 13.5534 21.4400 33.8321 28.4247 38.1862 74.0898 13.5771 26.4296 0.7928 13.2036 13.1094 13.7206 13.4661 218.2461 68.2306 504.2569 115.3500 23.5100 298.2338 433.9188 37.3476 44.5254 17.6766 6.2661 23.7817 12.9131 14.0785 34.7963 18.1194 9.8366 5.0018 7.3428 0.5021 1.9596 12.9134 67.2285
temp: 298.150 k
press: 1.00000 atm
elementType: 17 17 16 8 8 8 8 8 7 7 7 6 6 6 6 6 6 6 6 6 6 6 6 6 6 6 6 6 6 6 1 1 1 1 1 1 1 1 1 1 1 1 1 1 1 1
symmnumber: 1
zpe: 840411.7 jmol-1
zpe.correction: 0.320096 hartree
zpe.thermalcorrener: 0.348479 hartree
zpe.thermalcorrenthalpy: 0.349423 hartree
zpe.thermalcorrgfe: 0.259244 hartree
zpe.sumelectzpe: -2590.071920 hartree
zpe.sumelectthermal: -2590.043538 hartree
zpe.sumelectthermalent: -2590.042593 hartree
zpe.sumelectthermalfe: -2590.132772 hartree
dipole: -6.8327 -3.3903 0.2379
dipole: 7.6313
quadrupole: -268.3060 -221.7551 -219.1917
quadrupole: -13.5278 -0.0842 6.2643
quadrupole: -31.8884 14.6625 17.2259 -13.5278 -0.0842 6.2643
hfenergy: -2590.3920162 hartree
pointgroup: C01 [X(C19H16Cl2N3O5S1)]
dipole: -2.6724296 1.3682627 -0.0177382 debye
polarizability: 371.0310594|-46.4345379|249.0512036|16.9515432|17.6152915|240.9624848 unknown
InChI: InChI=1S/C19H16Cl2N3O5S/c1-7-10(12(23-29-7)11-8(20)5-4-6-9(11)21)15(25)22-13-16(26)24-14(18(27)28)19(2,3)30-17(13)24/h4-6,13-14,17,22H,1-3H3
charge -1 multiplicity 1
46 atoms
Cl -1.883009 -1.070457 2.471847
Cl -2.938397 -1.351669 -3.023655
S  2.89362 1.564303 1.946921
O  1.932918 1.534486 -2.468236
O  2.497583 -2.163803 0.808615
O  4.70415 -2.394167 0.060411
O  -1.708776 3.146654 0.587179
O  -5.290181 0.809448 0.086755
N  2.350011 0.356154 -0.372874
N  -0.64659 1.287272 -0.34892
N  -4.638966 -0.502574 -0.098609
C  1.57784 0.780604 0.80967
C  4.367631 0.730169 0.92914
C  3.674432 -0.216065 -0.14773
C  0.727107 1.715483 -0.139385
C  1.740488 1.253273 -1.263583
C  5.132492 1.871016 0.220521
C  5.266524 -0.025824 1.921849
C  3.611636 -1.743866 0.284986
C  -1.761177 1.962624 0.114326
C  -3.052885 1.212076 0.030518
C  -3.318869 -0.210921 -0.129169
C  -4.307645 1.798848 0.167863
C  -2.302636 -1.286111 -0.289573
C  -4.773942 3.196579 0.397041
C  -1.496416 -1.710226 0.806098
C  -1.967417 -1.835137 -1.55365
C  -0.368459 -2.528957 0.65534
C  -0.866218 -2.696734 -1.743003
C  -0.050331 -3.010841 -0.636475
H  1.060234 -0.023176 1.34613
H  4.262209 -0.165071 -1.081367
H  0.7534 2.785795 0.112012
H  6.022009 1.455591 -0.293828
H  4.495239 2.372015 -0.529687
H  5.473448 2.63158 0.946071
H  6.035706 -0.590399 1.364292
H  5.753184 0.681586 2.619081
H  4.680782 -0.757306 2.501463
H  -0.77623 0.359456 -0.758247
H  -4.841284 3.409723 1.480343
H  -4.036762 3.902512 -0.014949
H  -5.768204 3.35423 -0.054038
H  0.316773 -2.738723 1.477258
H  -0.625749 -3.060682 -2.744946
H  0.874223 -3.581968 -0.753009
