program: Gaussian 09
title: 000028981
version: EM64L-G09RevD.01
frameworkgroup: C1[X(C19H28N2O3)]
method: RPBEPBE
basis: SDD
operation: Freq
keyword: #p
keyword: freq=noraman
keyword: PBEPBE/SDD
title: #p freq=noraman PBEPBE/SDD
converged: YES YES NO NO
title: Mulliken charges:
elementType: O O O N N C C C C C C C C C C C C C C C C C C C H H H H H H H H H H H H H H H H H H H H H H H H H H H H
charge: -0.273808 -0.299526 -0.290863 -0.204470 -0.109580 0.214498 0.197373 0.252327 -0.046914 -0.406603 -0.518639 0.345823 -0.336678 -0.282883 -0.325628 -0.329089 -0.387141 -0.662300 -0.826744 0.164837 -0.670298 -0.668966 -0.210834 -0.680960 0.220263 0.213262 0.304834 0.235353 0.202534 0.222391 0.204547 0.189791 0.208171 0.192159 0.246784 0.256243 0.243029 0.242682 0.231541 0.316851 0.230833 0.211887 0.226371 0.206087 0.208660 0.225104 0.206349 0.224367 0.223853 0.224384 0.210716 0.228021
chargesum: 0.00000
title: Mulliken charges with hydrogens summed into heavy atoms:
elementType: O O O N N C C C C C C C C C C C C C C C C C C C
charge: -0.273808 -0.299526 -0.290863 -0.204470 -0.109580 0.214498 0.197373 0.252327 -0.046914 0.026922 -0.213805 0.345823 -0.101325 0.142043 0.068710 0.071241 -0.140357 0.079653 -0.047520 0.164837 -0.025953 -0.028853 0.237386 -0.017839
polarizability: 3.23698470e+02 -3.03382276e+00 2.68413602e+02 -1.14321765e-01 2.28170083e+00 1.50780751e+02
1716.lowfreq: -9.9964 -2.3651 -0.0005 0.0005 0.0005 2.5196 12.2926 18.4330 26.4079
frequency: 9.8477 18.3875 26.4008 32.2998 56.0346 65.2789 70.7508 77.6279 86.0401 88.1743 92.1722 110.9679 122.9326 138.9293 157.7858 169.2868 172.4118 175.7445 201.1969 215.1113 237.9795 243.9339 251.5042 265.0598 288.5634 296.8351 314.9807 323.2263 334.0532 367.8040 385.3315 390.3078 399.5882 431.1895 442.3447 455.8612 494.2939 505.0381 563.9260 609.0338 610.2633 633.1931 670.2477 708.8702 725.1291 742.0551 763.0932 765.8530 794.2155 796.5794 798.2564 802.6445 813.7058 829.4776 853.0084 889.5688 913.8519 921.9779 931.6938 973.7301 986.4133 992.1130 1016.1083 1039.1471 1046.4544 1060.5858 1063.0193 1074.9855 1083.3171 1084.5138 1094.9203 1109.8149 1119.9002 1122.4944 1132.7285 1135.6054 1153.0911 1161.9248 1167.4949 1207.9236 1223.7835 1234.5651 1245.2913 1268.2521 1276.6933 1284.5594 1288.9264 1295.6630 1328.4681 1346.1665 1359.6000 1362.5892 1366.4992 1385.6401 1386.8266 1388.6000 1395.3380 1396.1868 1411.0386 1419.6111 1440.5741 1455.2946 1460.6443 1461.8262 1463.4575 1464.5765 1469.9204 1470.7627 1472.3009 1474.8801 1479.6854 1482.3809 1485.2384 1486.6726 1488.8459 1490.2508 1497.3910 1498.2465 1539.7026 1590.6291 1604.3991 1630.0105 2855.1224 2864.3798 2909.3265 2959.3076 2968.9155 2980.8421 2982.8298 2983.1438 2990.7775 3006.4777 3023.1990 3025.0043 3033.3751 3041.8153 3058.5877 3060.9440 3062.5219 3074.6719 3075.9283 3086.9989 3087.5797 3091.6156 3100.5092 3108.0975 3122.7016 3140.9428 3169.7119 3205.0292
redmass: 3.4457 3.7651 3.9585 3.1126 3.3086 2.9990 2.2238 1.4681 2.5316 2.1514 2.7859 3.5636 2.6375 2.6167 2.6555 2.2793 2.5899 1.0807 2.0783 1.3481 4.1772 3.0618 1.2961 2.0458 2.8316 2.4188 2.7591 5.2260 3.2727 4.5116 3.9406 6.6327 4.2863 3.2036 2.9939 3.1534 3.7536 3.9897 4.8572 3.7936 3.9171 5.3234 5.6507 4.8751 6.9398 3.5399 4.5619 4.0546 1.2151 1.1594 1.1077 1.5285 1.2368 3.4701 5.1411 1.4680 1.8957 2.9173 1.3268 7.9381 2.6501 2.3762 1.9685 2.9970 1.4903 2.3348 1.8110 1.9061 2.6572 2.1452 2.7696 2.2081 1.3128 1.7094 1.3128 1.4644 2.1674 1.4386 2.9375 2.2382 4.6194 1.6773 1.1361 1.7947 1.1458 1.2017 1.2461 2.4012 1.3683 1.8096 1.3473 1.6551 1.7923 1.2351 1.2790 1.5104 1.4039 1.2612 2.6322 4.3172 1.1859 2.1923 1.0906 1.0569 1.0443 3.5011 1.0642 1.0420 1.0878 1.0686 1.1087 1.3128 1.0990 1.0782 1.1240 1.1063 1.0538 1.3692 5.0982 7.7633 9.9338 7.7292 1.0720 1.0713 1.0702 1.0573 1.0391 1.0355 1.0357 1.0366 1.0355 1.0580 1.0906 1.0989 1.0876 1.0973 1.1017 1.0941 1.1061 1.0986 1.0980 1.1003 1.0987 1.1004 1.1026 1.0965 1.0970 1.0886 1.0960 1.0909
irintensity: 0.0161 0.1999 0.1423 1.5619 0.8657 0.1092 3.9088 0.3560 0.0134 0.4759 1.2647 2.8701 0.3640 1.8594 0.4401 1.1437 1.0881 0.3177 3.6089 0.4066 3.6291 2.0676 1.0863 0.2313 2.7542 1.2065 2.3528 1.2150 10.1538 8.7523 3.4798 0.1452 0.1485 2.4531 4.4320 1.9300 5.3395 15.6489 7.4019 6.7670 2.4420 0.0416 0.8885 12.2417 6.8090 14.4308 1.2015 3.7527 7.4570 8.9774 1.9317 49.6102 6.4793 4.2861 6.8722 20.1834 2.8701 47.4946 0.0369 23.5364 63.1349 50.6220 8.0776 203.2314 5.0886 23.1101 26.4881 18.8012 211.2373 1.9053 16.0944 1.6454 0.5199 8.6114 23.3588 5.4480 56.9518 41.7379 301.0847 38.8506 20.8225 18.7960 0.0556 1.8194 2.7272 17.5942 26.6445 43.3818 11.2089 29.4652 2.6489 8.1120 19.7373 18.6491 19.1415 3.9582 45.7771 15.0464 129.6210 7.4484 46.5707 149.5327 10.2583 3.0268 12.7169 19.8715 3.3734 23.1580 5.5414 10.8345 34.7276 70.7923 11.8749 21.1538 5.1838 28.4193 6.6140 11.9529 93.1953 61.4896 296.1638 137.4737 36.6530 179.6870 78.1030 33.2840 50.9491 33.1368 29.9861 68.8739 20.8432 27.9917 13.4360 23.2047 19.2378 17.4789 22.0568 36.4139 8.4737 39.0810 80.5125 62.3173 38.1401 38.3294 48.2363 2.0612 8.2031 9.8477 9.9083 8.5478
temp: 298.150 k
press: 1.00000 atm
elementType: 8 8 8 7 7 6 6 6 6 6 6 6 6 6 6 6 6 6 6 6 6 6 6 6 1 1 1 1 1 1 1 1 1 1 1 1 1 1 1 1 1 1 1 1 1 1 1 1 1 1 1 1
symmnumber: 1
zpe: 1149136.1 jmol-1
zpe.correction: 0.437683 hartree
zpe.thermalcorrener: 0.464563 hartree
zpe.thermalcorrenthalpy: 0.465507 hartree
zpe.thermalcorrgfe: 0.377183 hartree
zpe.sumelectzpe: -1074.155842 hartree
zpe.sumelectthermal: -1074.128962 hartree
zpe.sumelectthermalent: -1074.128018 hartree
zpe.sumelectthermalfe: -1074.216342 hartree
dipole: 0.1183 -1.7832 -0.4661
dipole: 1.8469
quadrupole: -114.1403 -141.3713 -146.3027
quadrupole: -20.9820 0.1449 -0.8376
quadrupole: 19.7978 -7.4332 -12.3646 -20.9820 0.1449 -0.8376
hfenergy: -1074.5935251 hartree
pointgroup: C01 [X(C19H28N2O3)]
dipole: 0.030467 0.6775199 0.2607993 debye
polarizability: 323.4838151|4.6691991|266.6219188|-1.3874187|15.3275788|152.7870895 unknown
InChI: InChI=1S/C19H28N2O3/c1-6-21(7-2)11-12-24-15-9-10-17-16(13-15)18(14(4)20(17)5)19(22)23-8-3/h9-10,13H,6-8,11-12H2,1-5H3
charge 0 multiplicity 1
52 atoms
O  -1.608601 1.980649 0.342467
O  1.143219 -2.288474 -0.459871
O  3.381986 -2.911399 -0.654707
N  3.94057 1.360462 0.09278
N  -4.832544 0.107929 0.107749
C  1.814414 0.489531 -0.008256
C  2.571096 1.688897 0.186748
C  4.075628 -0.006325 -0.154168
C  2.780948 -0.581748 -0.222905
C  -3.913555 1.265318 0.24709
C  0.398135 0.543524 0.033761
C  -0.214392 1.792887 0.272958
C  1.958135 2.937488 0.425459
C  -2.457897 0.79835 0.122028
C  -6.089461 0.432954 -0.617422
C  -5.064912 -0.603686 1.394681
C  0.553713 2.979497 0.467925
C  5.020236 2.338272 0.239293
C  5.417777 -0.660776 -0.30524
C  2.52572 -1.999863 -0.462806
C  -5.882672 0.585751 -2.13622
C  -5.395815 -2.096325 1.20254
C  0.786213 -3.714811 -0.699692
C  -0.736082 -3.8059 -0.624753
H  -4.115065 1.997521 -0.554228
H  -4.0463 1.803844 1.21446
H  -0.171335 -0.373378 -0.119223
H  2.542725 3.851249 0.574296
H  -2.222887 0.019977 0.877175
H  -2.27814 0.375777 -0.886043
H  -6.80145 -0.394025 -0.441546
H  -6.570148 1.356569 -0.205818
H  -4.141692 -0.521957 1.998371
H  -5.873118 -0.109491 1.991126
H  0.019729 3.917012 0.649169
H  5.994812 1.839092 0.136128
H  4.944396 3.122837 -0.536011
H  4.977168 2.820243 1.233335
H  5.987715 -0.236705 -1.154561
H  5.266567 -1.73491 -0.489751
H  6.036398 -0.544799 0.605722
H  -5.175765 1.401114 -2.37489
H  -5.478313 -0.349441 -2.561011
H  -6.841864 0.818103 -2.635958
H  -6.315722 -2.239582 0.607044
H  -4.569037 -2.60337 0.674437
H  -5.549685 -2.589113 2.180941
H  1.283968 -4.337814 0.065639
H  1.177689 -4.014791 -1.688986
H  -1.101468 -3.497142 0.370333
H  -1.058556 -4.847979 -0.80435
H  -1.208682 -3.161138 -1.386038
