program: Gaussian 09
title: 000029095
version: EM64L-G09RevD.01
frameworkgroup: C1[X(C27H23N2S2)]
method: RPBEPBE
basis: SDD
operation: Freq
keyword: #p
keyword: freq=noraman
keyword: PBEPBE/SDD
title: #p freq=noraman PBEPBE/SDD
converged: YES YES NO NO
title: Mulliken charges:
elementType: S S N N C C C C C C C C C C C C C C C C C C C C C C C C C C C H H H H H H H H H H H H H H H H H H H H H H H
charge: 0.306298 0.306334 -0.212802 -0.212424 0.524864 0.524563 -0.064564 -0.064339 -0.448516 -0.448293 0.252433 0.252197 -0.167665 -0.427439 -0.427880 0.445168 0.445102 -0.318476 -0.318304 -0.456280 -0.456233 -0.318738 -0.318347 -0.660204 -0.660288 -0.425576 -0.425581 -0.278861 -0.278777 -0.230179 -0.230134 0.264314 0.272990 0.243770 0.273018 0.244152 0.262449 0.262440 0.263472 0.263438 0.238601 0.238269 0.228618 0.246534 0.250758 0.246511 0.250666 0.228587 0.258308 0.258308 0.245734 0.245714 0.253158 0.253132
chargesum: 1.00000
title: Mulliken charges with hydrogens summed into heavy atoms:
elementType: S S N N C C C C C C C C C C C C C C C C C C C C C C C C C C C
charge: 0.306298 0.306334 -0.212802 -0.212424 0.524864 0.524563 -0.064564 -0.064339 -0.448516 -0.448293 0.252433 0.252197 0.096649 0.089321 0.089290 0.445168 0.445102 -0.056027 -0.055864 -0.192808 -0.192795 -0.080137 -0.080078 0.065706 0.065477 -0.167268 -0.167273 -0.033127 -0.033063 0.022978 0.022998
polarizability: 8.45800872e+02 3.88475009e-03 3.61116195e+02 -5.05743484e+00 -1.39819235e-01 1.39395447e+02
1716.lowfreq: -5.4417 -3.5392 -0.0012 0.0008 0.0016 7.0822 21.7851 23.0141 40.0927
frequency: 20.6043 22.5640 40.0750 53.1647 53.4165 60.7560 106.1621 117.7822 126.1643 131.7779 134.3474 139.6717 150.4785 176.1355 209.4828 209.8225 220.5113 241.2820 264.3218 271.9515 276.2250 296.7268 322.1966 338.6042 345.1125 365.5927 378.7440 387.3250 399.6092 431.0827 440.2890 483.5216 487.6989 493.8829 505.0032 505.7078 506.4116 522.5337 533.1290 539.4805 561.5333 563.4950 596.1228 602.0067 615.0955 630.9934 634.2228 643.0228 671.5291 674.1155 678.0129 714.1819 752.5273 756.0971 758.1861 766.8775 789.2423 789.4545 802.0868 807.4197 821.0508 821.1666 836.9631 837.8357 878.4416 882.7146 883.1909 886.7133 923.1934 924.6682 959.6942 959.7071 978.8277 978.8806 1004.9665 1005.2351 1008.2993 1020.8067 1045.0036 1046.9002 1070.9408 1072.9015 1086.3327 1091.5556 1137.2943 1141.6062 1155.0469 1158.6879 1164.4788 1164.6161 1191.4386 1191.6082 1205.0245 1219.7585 1239.7720 1240.0732 1249.6149 1268.1495 1281.7466 1292.3453 1306.9821 1315.7173 1337.9402 1346.3604 1357.7102 1372.5368 1378.4738 1398.4236 1398.6778 1402.2348 1403.0624 1412.9503 1413.1588 1430.2964 1433.2967 1439.0323 1445.2924 1451.4182 1466.7900 1469.6177 1492.3318 1493.7264 1514.4832 1515.3943 1526.2873 1527.6989 1570.2509 1574.4148 1580.2809 1589.1662 1593.3659 1627.8144 1627.9923 2998.3917 2998.5936 3030.3912 3031.7144 3086.1253 3086.4328 3101.0848 3101.6497 3108.7500 3109.9261 3139.7683 3139.7731 3150.5302 3150.5651 3151.7923 3151.8118 3173.8732 3173.9143 3175.5360 3175.6437 3188.0463 3213.1503 3213.1996
redmass: 6.2887 4.7052 4.6630 3.7292 4.7700 4.9781 4.3927 6.4066 4.9637 3.5099 5.7221 2.4844 4.1851 4.0466 1.2109 1.2930 3.0065 3.9838 5.8133 4.3541 5.0503 4.8819 5.4419 5.1080 4.2334 5.4618 2.9937 8.0198 3.7888 3.3744 3.9396 4.0450 4.4816 5.3881 4.3518 3.8544 4.9901 4.4022 4.0208 5.5101 3.8379 4.3026 3.6296 5.3914 6.7955 7.3001 7.0480 6.2375 5.3775 4.8995 5.1571 4.0704 1.4895 1.2774 1.5248 1.6317 3.1559 3.1868 1.3769 2.3806 1.4197 1.4060 3.3523 2.3309 6.2306 1.7011 1.6483 4.5144 2.8348 3.2381 1.3330 1.3330 1.4163 1.4153 1.4603 1.3749 3.1606 4.0957 2.4832 2.4797 2.4304 2.9700 1.9107 2.0764 1.9959 1.7913 2.3515 2.1914 1.2872 1.2925 1.1482 1.1808 2.4226 1.9258 1.9404 1.9233 2.3593 1.7215 1.7518 1.6301 2.5861 1.6092 1.6107 1.5507 1.2889 2.2664 2.4737 5.1781 5.3558 1.2570 1.2648 4.5002 4.6868 2.6333 2.4978 2.8551 2.0441 2.6081 1.0484 1.0602 1.0574 1.0617 1.6225 1.7582 1.8725 1.6143 6.6487 7.6601 7.3634 6.1992 6.2099 6.4492 6.4761 1.0367 1.0367 1.0681 1.0682 1.0978 1.0979 1.0992 1.0990 1.0991 1.0990 1.0882 1.0883 1.0906 1.0905 1.0893 1.0893 1.0988 1.0988 1.0983 1.0983 1.0855 1.0915 1.0915
irintensity: 0.0393 0.0089 0.0038 1.2805 0.0584 0.0049 0.1249 0.0024 1.8044 0.0010 0.5076 0.3982 0.1058 0.0059 0.3224 1.3507 4.8080 0.0003 1.5877 3.1094 0.6252 0.0005 1.9172 1.9838 1.2280 2.8298 0.3690 3.2562 4.7564 0.7024 2.2593 31.6080 0.0522 4.6554 0.0189 7.0953 2.0723 21.2436 15.9695 1.3203 0.9656 4.2771 2.4639 0.8285 0.0981 0.4038 0.1982 1.7129 27.6879 0.4316 16.8255 0.0089 57.2961 1.2049 71.8666 57.2130 0.0950 40.0953 0.0054 7.1168 88.3325 6.2075 0.6537 17.2415 19.2143 0.0740 33.0190 1.0810 0.9440 4.5358 0.0915 0.0992 4.8366 0.5267 3.9915 0.0212 20.5183 2.4100 10.8638 0.1131 21.4614 3.7780 10.6090 17.3728 33.2790 13.5034 33.7757 0.5131 3.1415 7.0603 0.3620 1.5174 4.3813 33.4262 6.7546 0.8344 193.3655 6.3939 25.1543 46.5349 52.3245 0.8778 86.5055 13.4780 0.2599 22.2310 126.2499 6.1524 15.2148 20.5589 23.3387 2.1173 0.3283 2.0846 1.2988 3.5640 60.8912 0.1127 24.7614 0.0159 7.3224 0.1620 0.1990 31.1133 33.0499 28.1540 815.5873 0.2662 604.8631 3.8579 719.3137 3.1117 4.8495 8.7147 9.1972 18.0660 10.9079 15.7776 4.2792 15.0544 15.5450 14.7869 9.0825 2.3762 0.8847 2.4629 2.3378 3.2676 5.9056 26.1475 8.9065 9.5378 5.6338 0.1655 4.7064 10.6639
temp: 298.150 k
press: 1.00000 atm
elementType: 16 16 7 7 6 6 6 6 6 6 6 6 6 6 6 6 6 6 6 6 6 6 6 6 6 6 6 6 6 6 6 1 1 1 1 1 1 1 1 1 1 1 1 1 1 1 1 1 1 1 1 1 1 1
symmnumber: 1
zpe: 1121538.9 jmol-1
zpe.correction: 0.427172 hartree
zpe.thermalcorrener: 0.453331 hartree
zpe.thermalcorrenthalpy: 0.454275 hartree
zpe.thermalcorrgfe: 0.370568 hartree
zpe.sumelectzpe: -1945.978419 hartree
zpe.sumelectthermal: -1945.952259 hartree
zpe.sumelectthermalent: -1945.951315 hartree
zpe.sumelectthermalfe: -1946.035023 hartree
dipole: 0.0055 3.2364 0.0029
dipole: 3.2364
quadrupole: -59.2166 -147.3371 -202.8215
quadrupole: 0.0042 -1.3971 0.0178
quadrupole: 77.2418 -10.8787 -66.3631 0.0042 -1.3971 0.0178
hfenergy: -1946.4055906 hartree
pointgroup: C01 [X(C27H23N2S2)]
dipole: 0.0642087 1.2379158 0.2910131 debye
polarizability: 843.2079044|-17.5300533|349.9631008|-35.3596302|51.1127676|153.1415089 unknown
InChI: InChI=1S/C27H23N2S2/c1-3-28-24(30-22-15-13-18-9-5-7-11-20(18)26(22)28)17-25-29(4-2)27-21-12-8-6-10-19(21)14-16-23(27)31-25/h5-17H,3-4H2,1-2H3
charge 1 multiplicity 1
54 atoms
S  -1.581876 -1.81695 -0.444904
S  1.524363 -2.015994 -0.313301
N  -2.364472 0.554223 0.416264
N  2.563854 0.397171 -0.04423
C  -3.588662 -0.158207 0.205481
C  3.703906 -0.454956 -0.199583
C  -1.202028 -0.134343 0.085436
C  1.329862 -0.244341 -0.028951
C  -3.346182 -1.482893 -0.212304
C  3.318631 -1.794557 -0.412081
C  -4.957465 0.296957 0.368333
C  5.115036 -0.116891 -0.168265
C  0.096249 0.409344 0.168738
C  -2.266126 1.886203 1.081547
C  2.616857 1.888419 -0.048809
C  -5.997302 -0.711012 0.196568
C  6.044108 -1.19531 -0.484884
C  -4.361817 -2.450007 -0.411718
C  4.226819 -2.846396 -0.686888
C  -5.675945 -2.058779 -0.179021
C  5.579415 -2.528198 -0.746386
C  -5.384507 1.641807 0.638557
C  5.680794 1.155765 0.184202
C  -2.187528 3.064884 0.090641
C  2.625032 2.508989 1.362585
C  -7.371976 -0.348906 0.37493
C  7.452593 -0.934138 -0.506335
C  -6.737124 1.961484 0.79313
C  7.062444 1.370637 0.16632
C  -7.744387 0.959562 0.680775
C  7.96174 0.327108 -0.199045
H  0.153411 1.469656 0.417417
H  -3.126962 1.979428 1.759469
H  -1.375136 1.861964 1.733082
H  3.502095 2.185289 -0.630149
H  1.746793 2.24471 -0.627779
H  -4.116284 -3.468018 -0.725175
H  3.872368 -3.866409 -0.85659
H  -6.491455 -2.778921 -0.30054
H  6.315217 -3.305476 -0.976287
H  -4.67118 2.462878 0.694212
H  5.053259 1.983049 0.512645
H  -1.297402 2.995258 -0.558702
H  -2.130943 4.016333 0.648377
H  -3.070354 3.10531 -0.569153
H  2.672859 3.609484 1.284033
H  3.490912 2.169434 1.955381
H  1.716297 2.245142 1.93115
H  -8.134086 -1.126388 0.252321
H  8.129886 -1.757478 -0.758725
H  -7.024359 2.999133 0.991678
H  7.456989 2.352161 0.448454
H  -8.798073 1.222555 0.813078
H  9.039844 0.512334 -0.216996
