program: Gaussian 09
title: 000002876
version: EM64L-G09RevD.01
frameworkgroup: C1[X(C13H12O3S)]
method: RPBEPBE
basis: SDD
operation: Freq
keyword: #p
keyword: freq=noraman
keyword: PBEPBE/SDD
title: #p freq=noraman PBEPBE/SDD
converged: YES YES NO NO
title: Mulliken charges:
elementType: S O O O C C C C C C C C C C C C C H H H H H H H H H H H H
charge: 0.194133 -0.193860 -0.202052 -0.428930 0.262933 0.286546 0.410031 -0.559278 -0.172930 0.125787 -0.365978 -0.366757 -0.808632 -0.585240 -0.223351 -0.224225 -0.315658 0.290226 0.288078 0.236567 0.280126 0.247735 0.283989 0.279916 0.242159 0.242116 0.204581 0.236281 0.335689
chargesum: 0.00000
title: Mulliken charges with hydrogens summed into heavy atoms:
elementType: S O O O C C C C C C C C C C C C C
charge: 0.194133 -0.193860 -0.202052 -0.093241 0.262933 0.286546 0.410031 -0.559278 -0.172930 0.125787 -0.075753 -0.078679 -0.044204 -0.021335 0.018808 0.017891 0.125203
polarizability: 2.60813154e+02 -1.25862243e+01 1.97446222e+02 -1.94609541e+01 4.89926368e+00 8.68933364e+01
1716.lowfreq: -8.9776 -4.7685 -0.0011 0.0017 0.0018 4.3380 22.5536 37.0101 58.8711
frequency: 22.3657 36.9783 58.8669 83.1340 111.3066 127.9006 137.1670 150.7383 170.8080 218.4211 231.8348 263.4601 278.6071 324.2634 354.0987 380.5197 394.9587 405.9461 422.2597 424.0561 450.6969 481.4688 525.3009 564.3950 601.1740 646.4852 678.7714 689.6252 713.9585 787.9964 801.2836 821.0709 829.5441 840.1776 916.8185 927.9356 951.0638 996.2067 1004.4680 1013.8690 1025.5602 1030.8535 1039.1277 1046.6242 1087.5612 1113.0186 1150.1915 1160.4810 1172.4452 1185.4352 1252.0459 1266.0194 1281.4778 1304.5624 1323.6387 1374.5152 1388.5563 1401.0538 1411.7612 1438.1076 1450.4570 1465.1932 1468.9980 1471.6536 1525.8730 1541.8776 1548.4942 1598.2560 1605.2107 2957.0651 2976.8117 3049.1154 3060.5780 3073.0231 3112.4727 3139.2262 3152.2642 3154.0491 3164.9644 3174.2376 3518.4724
redmass: 6.8521 6.4365 4.4113 4.1704 2.3005 1.6399 4.2127 3.7422 5.5657 3.8859 3.3898 4.1137 5.0481 3.9771 4.1087 7.9698 1.2443 6.6329 5.1071 3.4347 3.4304 7.7355 4.6265 6.6299 4.3490 6.4736 5.9968 4.2936 3.0129 5.6075 1.5852 2.1519 5.2487 3.6794 1.8034 1.5732 5.8903 1.3910 1.8551 1.3601 2.1076 1.9555 1.7625 2.5137 2.3388 3.1430 1.1470 1.2728 1.0963 2.4217 2.1009 1.2638 2.9277 3.6779 1.2263 1.2194 1.2307 9.6828 1.0933 2.1099 1.1705 1.0805 1.5302 1.5859 9.8255 10.4589 7.2267 8.0800 6.6218 1.0688 1.0384 1.0955 1.0797 1.0723 1.0979 1.0864 1.1085 1.0903 1.0946 1.1003 1.0655
irintensity: 0.5061 1.2624 4.7900 3.8358 0.4370 1.0431 1.7914 4.7751 3.2095 0.9591 0.8003 1.3882 0.4559 8.2958 14.4750 6.0820 212.3321 3.5059 0.2902 2.1074 7.7715 1.7767 0.5830 3.4378 22.8422 9.6465 0.0446 1.8073 63.3427 39.6122 39.4103 4.2113 30.8752 8.0136 56.8917 0.1757 30.3242 3.6635 14.7894 0.0494 26.8455 6.1767 21.2071 40.5648 7.7027 24.7381 11.1950 24.2329 6.3707 25.1503 44.5673 11.1165 163.0336 279.9923 8.5717 23.7754 56.2774 0.3135 28.0478 1.4687 36.0705 7.2493 13.0239 18.2054 50.6957 224.5908 155.2928 8.1433 0.8040 69.1193 6.2967 10.6099 5.3378 17.9131 3.7806 3.8810 9.4930 5.3681 1.3992 25.9503 6.2653
temp: 298.150 k
press: 1.00000 atm
elementType: 16 8 8 8 6 6 6 6 6 6 6 6 6 6 6 6 6 1 1 1 1 1 1 1 1 1 1 1 1
symmnumber: 1
zpe: 571224.8 jmol-1
zpe.correction: 0.217568 hartree
zpe.thermalcorrener: 0.233827 hartree
zpe.thermalcorrenthalpy: 0.234771 hartree
zpe.thermalcorrgfe: 0.172429 hartree
zpe.sumelectzpe: -1125.082486 hartree
zpe.sumelectthermal: -1125.066227 hartree
zpe.sumelectthermalent: -1125.065283 hartree
zpe.sumelectthermalfe: -1125.127625 hartree
dipole: -1.6871 -1.6503 -0.7272
dipole: 2.4695
quadrupole: -98.0266 -106.7785 -113.4531
quadrupole: 8.8702 -9.1769 -2.0781
quadrupole: 8.0595 -0.6924 -7.3671 8.8702 -9.1769 -2.0781
hfenergy: -1125.3000541 hartree
pointgroup: C01 [X(C13H12O3S1)]
dipole: -0.7119798 -0.6412148 -0.1609417 debye
polarizability: 258.3880988|-20.6981894|197.8720162|-16.1133362|-15.5805219|88.8925971 unknown
InChI: InChI=1S/C13H12O3S/c1-8-11(15)9-4-2-3-5-10(9)12(16)13(8)17-7-6-14/h2-5,14H,6-7H2,1H3
charge 0 multiplicity 1
29 atoms
S  2.711707 0.076434 -0.778247
O  -1.514357 3.010778 -0.258154
O  0.549012 -2.071258 -0.253647
O  4.847744 -0.051965 1.661461
C  -1.912589 0.655155 0.069019
C  -1.370406 -0.658161 0.096559
C  0.419825 1.594936 -0.475125
C  0.942256 0.310606 -0.407392
C  -1.037603 1.828476 -0.232843
C  0.078482 -0.891736 -0.185298
C  -3.289907 0.853518 0.325401
C  -2.208533 -1.763363 0.380303
C  1.265057 2.807505 -0.772929
C  3.288078 -1.421722 0.273218
C  -4.12134 -0.250135 0.610965
C  -3.580312 -1.559932 0.637993
C  4.737291 -1.148417 0.697442
H  -3.681923 1.874927 0.295006
H  -1.766404 -2.764354 0.390223
H  2.184484 2.806966 -0.157967
H  0.685795 3.724796 -0.587685
H  1.593276 2.813962 -1.830368
H  2.626436 -1.492246 1.148429
H  3.18119 -2.324998 -0.343954
H  -5.186875 -0.094949 0.810413
H  -4.228177 -2.414921 0.857904
H  5.381568 -0.971833 -0.191007
H  5.122686 -2.036278 1.228458
H  4.41854 0.750008 1.261823
