program: Gaussian 09
title: 000028922
version: EM64L-G09RevD.01
frameworkgroup: C1[X(C14H15NO3)]
method: RPBEPBE
basis: SDD
operation: Freq
keyword: #p
keyword: freq=noraman
keyword: PBEPBE/SDD
title: #p freq=noraman PBEPBE/SDD
converged: YES YES NO NO
title: Mulliken charges:
elementType: O O O N C C C C C C C C C C C C C C H H H H H H H H H H H H H H H
charge: -0.246038 -0.279935 -0.193617 -0.111738 -0.343989 -0.361902 0.136696 0.093052 0.384816 -0.363856 0.163103 -0.654944 -0.648906 0.060474 -0.383078 -0.340105 -0.250542 -0.204352 0.202765 0.257968 0.223309 0.250964 0.278655 0.253567 0.214026 0.212868 0.222501 0.215738 0.222087 0.245527 0.268277 0.237485 0.239122
chargesum: 0.00000
title: Mulliken charges with hydrogens summed into heavy atoms:
elementType: O O O N C C C C C C C C C C C C C C
charge: -0.246038 -0.279935 -0.193617 -0.111738 0.116744 0.112371 0.136696 0.093052 0.384816 -0.085200 0.163103 0.025518 0.011420 0.060474 -0.137551 -0.071829 -0.013057 0.034770
polarizability: 2.75284827e+02 1.66476364e+01 1.54424822e+02 -9.66030425e+00 1.05536275e+00 1.07853117e+02
1716.lowfreq: -6.1285 0.0010 0.0011 0.0011 5.7352 10.4792 29.4504 39.1365 53.0016
frequency: 29.3674 39.0704 52.9125 60.8972 68.8578 105.9659 123.8126 157.4154 177.4123 210.3564 223.0561 240.3744 265.0510 297.7109 304.7894 322.5836 362.0559 407.8281 433.3323 452.9277 481.7760 500.5241 534.3818 549.5945 572.2287 595.9046 639.3251 673.6910 727.1627 746.1257 751.9690 766.1790 768.2913 772.6076 792.8108 849.9672 870.0083 893.7770 901.3406 937.2932 943.6419 962.8933 990.6094 1007.7596 1023.8124 1069.0427 1079.2361 1089.2105 1098.7341 1114.9126 1163.2722 1177.8259 1204.7714 1210.7316 1246.5700 1265.0420 1284.4151 1301.7756 1337.6797 1349.2851 1356.0104 1386.1586 1387.9711 1405.4758 1416.7776 1440.3879 1453.9437 1466.3699 1469.1469 1475.1755 1476.0511 1482.0755 1490.0335 1550.5292 1563.3616 1602.3917 1619.6355 1661.2582 2984.0875 2988.4564 3009.9180 3015.7065 3070.8405 3078.2863 3085.9191 3086.4123 3105.6238 3121.3033 3135.7166 3142.6224 3147.5730 3167.1453 3180.2578
redmass: 4.2872 3.1787 3.4437 3.7994 3.0416 7.2975 4.3108 3.5371 3.8018 1.1195 1.3857 3.9685 5.4187 3.5326 4.1118 3.1080 3.2443 3.0117 6.5287 3.0732 5.4173 4.2779 6.0517 3.7419 5.3008 7.1714 4.5789 9.2555 6.6319 5.1488 4.1694 1.5350 1.5221 1.2599 1.9504 4.6301 1.4115 6.7469 3.5855 1.4660 2.0420 1.4575 1.3333 2.8071 2.0948 2.0886 2.0394 2.2634 1.8050 1.7824 1.7382 1.3561 2.4612 2.6446 1.6567 1.7284 1.5757 1.4404 1.2813 2.2045 1.3113 1.2134 1.2152 7.4749 2.8707 2.6605 1.1418 1.0450 1.0440 1.3735 1.8359 1.0601 1.1125 5.5480 6.3841 7.0068 7.0516 11.8321 1.0352 1.0356 1.0634 1.0685 1.1014 1.0987 1.0991 1.0994 1.1019 1.0943 1.0877 1.0925 1.0901 1.0955 1.0991
irintensity: 2.6990 0.3461 2.8239 1.9209 1.1573 0.8342 1.3987 2.6569 1.7951 0.0700 2.2457 0.6847 0.7348 1.1769 5.5401 0.8825 5.9625 1.6248 1.6192 4.3196 5.3792 12.9503 5.9599 0.8554 14.0725 19.9738 5.7234 7.2987 2.0206 0.4307 9.3761 36.9928 47.3110 6.9175 38.2860 81.6252 4.1292 4.4727 36.0637 4.0671 11.4422 16.2349 0.0635 13.6015 6.9657 12.9632 5.6172 11.8302 18.9000 13.6216 17.0731 19.4525 9.5490 41.4994 129.2730 11.3770 7.4216 27.6275 9.8827 6.1275 5.6151 3.6838 36.9750 7.7701 79.0384 33.4408 33.9807 5.9576 13.0600 10.3981 5.0334 10.0652 11.9370 145.6502 112.5147 22.5093 156.8609 454.2016 21.8989 29.4449 30.5777 32.9740 4.1357 21.2544 38.5184 44.1310 28.5002 22.4268 0.9679 1.8187 8.6086 16.6346 11.8616
temp: 298.150 k
press: 1.00000 atm
elementType: 8 8 8 7 6 6 6 6 6 6 6 6 6 6 6 6 6 6 1 1 1 1 1 1 1 1 1 1 1 1 1 1 1
symmnumber: 1
zpe: 685487.6 jmol-1
zpe.correction: 0.261088 hartree
zpe.thermalcorrener: 0.278125 hartree
zpe.thermalcorrenthalpy: 0.279069 hartree
zpe.thermalcorrgfe: 0.215088 hartree
zpe.sumelectzpe: -821.614875 hartree
zpe.sumelectthermal: -821.597838 hartree
zpe.sumelectthermalent: -821.596894 hartree
zpe.sumelectthermalfe: -821.660876 hartree
dipole: -2.0244 -1.9415 4.0101
dipole: 4.8937
quadrupole: -77.9083 -111.3235 -110.7460
quadrupole: 3.4910 5.7923 -1.5646
quadrupole: 22.0843 -11.3309 -10.7534 3.4910 5.7923 -1.5646
hfenergy: -821.8759634 hartree
pointgroup: C01 [X(C14H15N1O3)]
dipole: 0.9084307 -1.6470373 -0.4110422 debye
polarizability: 275.1957724|-9.27865|125.6917579|16.3786829|-23.2836218|136.6752352 unknown
InChI: InChI=1S/C14H15NO3/c1-3-15(4-2)13(16)11-9-10-7-5-6-8-12(10)18-14(11)17/h5-9H,3-4H2,1-2H3
charge 0 multiplicity 1
33 atoms
O  1.403684 1.224582 -1.032137
O  -2.015816 -0.136708 1.91696
O  -0.804139 1.74281 -1.397944
N  -2.740125 -0.591879 -0.24828
C  -4.136645 -0.706791 0.247232
C  -2.500381 -0.929444 -1.670247
C  -1.76569 -0.251311 0.668522
C  -0.334323 -0.040999 0.205467
C  2.070077 -0.47771 0.605104
C  0.672367 -0.7113 0.877113
C  2.404273 0.508114 -0.370051
C  -4.880589 0.643745 0.187121
C  -2.342762 -2.449101 -1.899954
C  -0.011902 1.009935 -0.773216
C  3.130492 -1.169126 1.259349
C  3.743488 0.80426 -0.698009
C  4.467953 -0.883427 0.94144
C  4.771547 0.102909 -0.038377
H  -4.65253 -1.46747 -0.366894
H  -4.098556 -1.066075 1.289707
H  -3.355866 -0.541914 -2.254508
H  -1.615918 -0.390262 -2.037196
H  0.391016 -1.429114 1.656209
H  -4.378749 1.381581 0.835187
H  -4.905474 1.045155 -0.841964
H  -5.921975 0.522807 0.538032
H  -1.459528 -2.83739 -1.362047
H  -3.230318 -3.005907 -1.548714
H  -2.21194 -2.659792 -2.977247
H  2.885911 -1.924516 2.01487
H  3.953879 1.569526 -1.450318
H  5.279479 -1.415998 1.446966
H  5.816061 0.323412 -0.282578
